program: Gaussian 09
title: 000230407
version: EM64L-G09RevD.01
frameworkgroup: C1[X(C6H8O5)]
method: RPBEPBE
basis: SDD
operation: Freq
keyword: #p
keyword: freq=noraman
keyword: PBEPBE/SDD
title: #p freq=noraman PBEPBE/SDD
converged: YES YES NO NO
title: Mulliken charges:
elementType: O O O O O C C C C C C H H H H H H H H
charge: -0.255758 -0.263905 -0.131784 -0.222370 -0.185179 -0.558496 0.146446 0.261003 0.177480 -0.496958 -0.496711 0.278597 0.276214 0.252018 0.241811 0.235052 0.251330 0.250665 0.240545
chargesum: 0.00000
title: Mulliken charges with hydrogens summed into heavy atoms:
elementType: O O O O O C C C C C C
charge: -0.255758 -0.263905 -0.131784 -0.222370 -0.185179 -0.003685 0.146446 0.261003 0.177480 0.231922 0.245830
polarizability: 1.02335542e+02 -5.84068327e+00 7.62072757e+01 -9.58437457e-01 -4.30124784e-01 6.11372838e+01
1716.lowfreq: -7.7863 -3.8202 -0.0005 0.0003 0.0005 3.7639 23.1526 29.9107 49.7868
frequency: 23.0364 29.8576 49.7769 80.5030 94.7398 102.9038 149.2918 152.5043 215.3051 252.9045 278.0623 347.0878 378.4206 414.1585 438.2069 572.4629 637.3562 661.3534 738.5061 790.5962 825.8496 921.8026 925.1530 975.4663 1029.3144 1112.6117 1113.3379 1124.0290 1143.7032 1149.5680 1151.1440 1234.6626 1300.1838 1406.3732 1420.4706 1423.7575 1453.3487 1453.6983 1460.0107 1463.1098 1638.8525 1645.1381 1661.2837 3008.4221 3010.0489 3025.9334 3088.9008 3112.4848 3114.8914 3154.5290 3160.3057
redmass: 5.9409 4.2521 6.7199 1.9426 1.5662 1.0784 4.5722 3.8891 5.8154 3.1009 4.1775 11.8086 2.4475 6.6136 7.1123 8.8140 4.8151 4.4913 6.2196 4.6925 6.2992 4.9998 4.4653 6.9296 4.0381 1.2759 1.2700 1.7179 4.9186 1.4447 1.4323 2.1046 1.8704 1.1078 1.1675 1.1905 1.0495 1.0489 1.0504 1.0505 10.1181 10.3265 10.1794 1.0294 1.0294 1.0607 1.0991 1.1048 1.1049 1.1050 1.1053
irintensity: 1.2428 0.9127 3.1752 1.5114 0.3573 0.2589 1.1219 2.5173 7.8448 21.1874 7.4112 4.2117 4.0435 10.6319 2.1300 7.8250 33.1271 2.6382 12.6952 15.2034 5.5409 1.5220 12.8568 81.1075 100.0044 3.6082 0.2803 127.9476 147.8517 5.0614 5.4985 150.3610 141.1173 42.2925 7.3514 27.4408 14.2979 17.1158 10.0747 10.6946 232.2611 40.5685 171.2729 29.6391 19.6337 5.5438 0.3754 22.1640 19.2078 14.4163 11.3027
temp: 298.150 k
press: 1.00000 atm
elementType: 8 8 8 8 8 6 6 6 6 6 6 1 1 1 1 1 1 1 1
symmnumber: 1
zpe: 359570.1 jmol-1
zpe.correction: 0.136953 hartree
zpe.thermalcorrener: 0.149733 hartree
zpe.thermalcorrenthalpy: 0.150677 hartree
zpe.thermalcorrgfe: 0.095037 hartree
zpe.sumelectzpe: -608.680718 hartree
zpe.sumelectthermal: -608.667938 hartree
zpe.sumelectthermalent: -608.666994 hartree
zpe.sumelectthermalfe: -608.722634 hartree
dipole: 1.3001 -3.7392 -2.3669
dipole: 4.6124
quadrupole: -46.9626 -69.5499 -65.8514
quadrupole: -11.3132 5.8064 0.5386
quadrupole: 13.8253 -8.7619 -5.0634 -11.3132 5.8064 0.5386
hfenergy: -608.8176706 hartree
pointgroup: C01 [X(C6H8O5)]
dipole: 0.5132334 -1.7213946 -0.2575206 debye
dipolederiv: -1.0231858 -0.0072332 -0.3723614 0.0343716 -0.2814805 -0.0831438 -0.5155582 -0.083724 -0.9270693 -0.8856862 0.3414393 -0.0432344 0.4218068 -0.9860499 0.2031395 -0.0674453 0.2125243 -0.3390622 -0.5600942 0.1335834 -0.0019079 0.0024112 -0.6695706 0.116567 0.0439706 0.1056524 -0.2721718 -0.6489172 0.022291 0.2629626 0.059057 -0.2964531 -0.1609929 -0.0716259 -0.0625409 -0.910774 -0.6568484 -0.3001683 0.1548944 0.062362 -0.7069996 0.1441093 0.0397981 0.2039432 -0.3653661 -0.4954508 -0.112838 0.0985564 -0.2912266 -0.3167763 0.1517442 0.1632108 0.1374758 -0.0366366 0.9557719 0.0587649 -0.1147338 0.3414914 0.9110257 -0.237868 -0.2095452 -0.2237172 0.257667 1.3314604 0.0028637 0.0280247 -0.1054959 0.1696735 0.2756592 0.4686392 0.1843132 1.5126405 0.7018852 0.0298456 -0.0763338 -0.4256258 1.3153156 -0.3476095 0.0632843 -0.4148983 0.3759708 0.5920254 -0.010029 0.1598186 -0.0437535 0.2667241 -0.0386798 0.0850544 -0.0211697 0.2638259 0.5203347 -0.1928785 0.0367247 -0.1435802 0.3068043 0.0048985 0.0147779 0.0129298 0.2627665 0.0366939 -0.0148515 -0.0343941 0.0355334 0.1341848 0.0011585 -0.0677182 0.0315557 0.0335182 0.0992337 -0.0064286 0.0306512 0.0501066 0.0814111 -0.0598674 0.0317521 -0.0733184 0.0601978 0.0050521 -0.0101401 -0.0412563 0.0594383 -0.0833946 -0.022641 0.0217807 -0.0675184 0.0936269 -0.0479419 -0.0339661 -0.0080906 -0.0557438 0.0055638 0.0831977 0.0929487 0.0969715 0.0308264 0.0462506 0.0017894 -0.0438051 -0.0006941 0.1151862 -0.0332327 -0.0966763 -0.0273492 -0.0869211 -0.0312872 0.0248512 -0.0445521 -0.0663772 0.0087401 -0.0975985 -0.0492966 -0.0702435 0.0320529 -0.0039769 0.0594302 0.0048658 0.0040619 0.0966633 0.036605 0.0661026 -0.0120058 -0.0853815 0.0646807 0.0136746 0.0041713 0.0618569 -0.0705678 0.0645548 -0.0134539 0.0711195 0.1002895 unknown
polarizability: 102.4627801|-5.7404728|73.2472767|0.3014674|-5.7565017|63.9700451 unknown
InChI: InChI=1S/C6H8O5/c1-10-5(8)3-4(7)6(9)11-2/h3H2,1-2H3
charge 0 multiplicity 1
19 atoms
O  -2.586892 -0.647312 -0.610984
O  2.255526 -0.960856 0.188628
O  -0.237941 1.54975 -0.290372
O  -2.521249 -0.218493 1.680915
O  2.591798 1.191789 -0.654884
C  -0.45538 -0.786245 0.452351
C  0.299304 0.452783 -0.035505
C  -1.942553 -0.520613 0.615954
C  1.83637 0.305585 -0.21449
C  -4.033169 -0.312811 -0.615076
C  3.715048 -1.224141 0.070252
H  -0.025256 -1.106054 1.417382
H  -0.28073 -1.606891 -0.266387
H  -4.17623 0.732088 -0.293995
H  -4.581506 -0.984203 0.066749
H  -4.350641 -0.455972 -1.656888
H  4.276986 -0.502635 0.686122
H  4.028525 -1.128932 -0.982545
H  3.845691 -2.251136 0.436271
