program: Gaussian 09
title: 000230405
version: EM64L-G09RevD.01
frameworkgroup: C1[X(C5H8Br2O2)]
method: RPBEPBE
basis: SDD
operation: Freq
keyword: #p
keyword: freq=noraman
keyword: PBEPBE/SDD
title: #p freq=noraman PBEPBE/SDD
converged: YES YES NO NO
title: Mulliken charges:
elementType: Br Br O O C C C C C H H H H H H H H
charge: 0.003978 0.047656 -0.246373 -0.220353 -0.420162 -0.512860 -0.629679 0.319114 -0.499086 0.299089 0.351622 0.273149 0.239393 0.254722 0.250459 0.242430 0.246901
chargesum: 0.00000
title: Mulliken charges with hydrogens summed into heavy atoms:
elementType: Br Br O O C C C C C
charge: 0.003978 0.047656 -0.246373 -0.220353 -0.121073 -0.161238 0.137586 0.319114 0.240703
polarizability: 1.11337072e+02 -5.46126317e+00 8.78699973e+01 3.88002324e+00 -2.86304991e+00 7.66375998e+01
1716.lowfreq: -0.0008 -0.0005 -0.0001 3.4503 6.4172 12.2348 35.7165 55.8878 85.6371
frequency: 35.6312 55.8597 85.6317 100.3924 115.0085 165.8369 195.3830 222.4192 257.1853 268.2122 282.0158 353.1483 442.3749 556.9569 621.9713 694.6164 727.4396 847.4496 880.3415 966.1859 1001.6827 1047.2353 1114.0251 1123.7055 1147.8798 1151.6067 1181.1504 1196.2637 1297.6581 1314.7231 1392.3238 1421.6001 1453.6519 1461.0147 1466.1977 1472.6950 1632.7249 2999.2001 3009.4582 3037.5382 3098.4804 3107.6428 3113.7798 3120.6500 3159.7250
redmass: 6.3468 7.3239 1.5113 2.4331 5.4181 4.5103 6.0565 7.7055 1.2973 2.2618 3.4213 5.0492 5.1484 4.5441 4.8756 4.9780 5.9248 6.0661 3.4816 3.8330 1.4066 1.5380 1.2757 2.0701 1.9770 1.6226 1.4477 1.3293 1.6918 1.3852 1.2013 1.1803 1.0494 1.0505 1.0428 1.0486 8.8773 1.0363 1.0295 1.0850 1.0979 1.0868 1.1050 1.1008 1.1051
irintensity: 1.8260 0.6614 0.6763 0.2139 1.4331 1.8319 3.1862 3.1450 1.2558 10.0792 10.8202 10.4549 15.6937 34.6078 20.6394 6.7925 8.3811 7.1270 16.0109 5.3206 45.0068 84.5088 3.1973 147.4137 19.8092 41.8298 19.3598 31.9421 116.3540 9.2757 32.4005 18.0362 17.4583 11.3810 17.4273 8.1044 173.5630 10.0744 25.0516 5.0201 5.1325 1.6624 20.7020 11.2335 11.9301
temp: 298.150 k
press: 1.00000 atm
elementType: 35 35 8 8 6 6 6 6 6 1 1 1 1 1 1 1 1
symmnumber: 1
zpe: 325364.4 jmol-1
zpe.correction: 0.123925 hartree
zpe.thermalcorrener: 0.135336 hartree
zpe.thermalcorrenthalpy: 0.136280 hartree
zpe.thermalcorrgfe: 0.083595 hartree
zpe.sumelectzpe: -371.975942 hartree
zpe.sumelectthermal: -371.964531 hartree
zpe.sumelectthermalent: -371.963587 hartree
zpe.sumelectthermalfe: -372.016272 hartree
dipole: 2.7046 -1.6206 -0.4833
dipole: 3.1898
quadrupole: -64.8518 -71.8182 -73.9295
quadrupole: -2.4884 -6.3562 2.5334
quadrupole: 5.3480 -1.6184 -3.7296 -2.4884 -6.3562 2.5334
hfenergy: -372.0998671 hartree
pointgroup: C01 [X(C5H8Br2O2)]
dipole: 1.1504489 -0.4921692 0.0959414 debye
dipolederiv: -0.5179863 -0.1228311 -0.1919106 -0.0877037 -0.1184068 -0.0515568 -0.2014849 -0.0911398 -0.3052302 -0.1545713 0.044512 -0.0184565 0.0169635 -0.4351461 0.1213063 -0.0142652 0.0753693 -0.0999798 -1.3558891 0.1555429 0.2809014 0.1206157 -0.2885773 -0.0252715 0.4731307 -0.0636092 -0.6628711 -0.6513581 0.0959409 -0.1548412 0.050274 -0.2770784 0.0484837 0.2326305 0.0898719 -0.8932193 0.745812 0.266994 0.2994817 0.060309 -0.0709147 0.1578571 0.3898042 0.2008004 0.4216465 -0.1954898 0.0301373 -0.0716642 0.1753636 0.7302743 -0.1452689 -0.2075971 -0.1403775 -0.0692939 -0.1873144 -0.0716553 -0.1260073 -0.017875 0.009504 -0.060349 -0.0569544 -0.1215588 -0.197024 1.4500214 -0.3861559 -0.0976194 -0.2902146 0.1195582 -0.0329326 -0.5363683 -0.0670749 1.3004587 0.6686283 -0.0565472 -0.0603304 -0.0330908 0.2871546 0.006652 0.040163 0.0026488 0.2134032 -0.0650414 -0.0114883 -0.0298905 0.0448413 -0.0372554 -0.0185349 -0.0261436 0.0356023 0.0098787 0.0823814 0.0273547 0.0182859 0.0038651 -0.0433286 -0.0210021 0.0236314 0.0103935 0.0241632 0.0908756 0.0186043 -0.0729523 -0.0307116 0.0991389 -0.0347175 -0.1301938 -0.0425863 0.0456267 -0.0001948 -0.0749924 0.1189348 -0.0934541 0.0330037 0.0640606 0.0801169 0.0468816 0.0462931 0.1110985 0.0582046 0.0163993 0.0736489 -0.040132 0.0000101 -0.0263676 0.0596037 0.0897737 -0.0122302 0.0192217 0.0076461 -0.0441792 -0.0482622 -0.0777618 -0.0790557 -0.0846262 0.0595326 -0.0015283 0.0141811 0.061756 0.0103196 0.1239016 -0.0080582 0.1110991 -0.0162413 -0.0369372 -0.0072134 -0.0070233 0.020267 0.0410282 -0.0434337 0.0770835 -0.0721454 0.1060425 0.0537792 unknown
polarizability: 111.0689352|0.6199836|84.3237343|8.0791429|-4.7915108|80.4519995 unknown
InChI: InChI=1S/C5H8Br2O2/c1-3(6)4(7)5(8)9-2/h3-4H,1-2H3
charge 0 multiplicity 1
17 atoms
Br -3.156221 -0.987639 -0.765819
Br -0.626447 1.804753 -0.776497
O  1.982079 -0.432036 -0.876861
O  1.313835 -0.439494 1.356051
C  -1.464874 -0.822623 0.382996
C  -0.356808 -0.194206 -0.476489
C  -1.807947 -0.13903 1.705066
C  1.03726 -0.357835 0.138046
C  3.397557 -0.528958 -0.434391
H  -1.19195 -1.882077 0.543843
H  -0.354415 -0.601354 -1.498128
H  -0.890153 -0.071746 2.317546
H  -2.564018 -0.724872 2.252527
H  -2.198904 0.877077 1.537202
H  3.668847 0.366846 0.14852
H  3.975637 -0.588623 -1.366059
H  3.540323 -1.428781 0.186545
