program: Gaussian 09
title: 000230404
version: EM64L-G09RevD.01
frameworkgroup: C1[X(C5H6Br2O4)]
method: RPBEPBE
basis: SDD
operation: Freq
keyword: #p
keyword: freq=noraman
keyword: PBEPBE/SDD
title: #p freq=noraman PBEPBE/SDD
converged: YES YES NO NO
title: Mulliken charges:
elementType: Br Br O O O O C C C C C H H H H H H
charge: 0.066534 0.086798 -0.388318 -0.384250 -0.213844 -0.221787 -0.235595 -0.550230 -0.644987 0.258392 0.271545 0.376136 0.254983 0.267426 0.271264 0.394790 0.391143
chargesum: 0.00000
title: Mulliken charges with hydrogens summed into heavy atoms:
elementType: Br Br O O O O C C C C C
charge: 0.066534 0.086798 0.006472 0.006893 -0.213844 -0.221787 -0.235595 -0.174094 0.148686 0.258392 0.271545
polarizability: 1.01075637e+02 6.00663937e-01 1.12529679e+02 -1.69215708e+00 1.87155216e+00 7.86763113e+01
1716.lowfreq: -10.9700 -7.6630 -4.4602 -0.0007 -0.0003 0.0003 49.3210 57.1543 79.8189
frequency: 49.2978 57.1450 79.8134 98.7298 123.2622 148.1913 184.1941 205.1734 232.2427 262.6483 272.9232 321.0002 331.7404 430.1581 520.3527 540.8458 568.5862 586.9994 642.6756 658.0219 726.5447 743.1992 758.3042 885.0898 939.2260 1029.1277 1043.7100 1078.2683 1126.5032 1183.8114 1208.9024 1263.6442 1315.1712 1343.5070 1391.6662 1465.7837 1469.9716 1623.7798 1648.7189 3006.4155 3108.0293 3123.8001 3140.6377 3521.4526 3521.9695
redmass: 11.3340 10.5883 11.8895 20.9585 10.5069 10.2217 6.2612 6.3396 10.8329 1.7300 1.9815 2.5952 6.5041 5.4922 2.7938 3.0366 2.1792 1.9477 2.0196 2.9832 5.4719 6.7435 4.2337 4.1326 2.9418 2.0248 2.4056 1.9417 1.6278 1.3296 3.9688 1.4874 2.4824 1.9483 1.1932 1.0537 1.0503 10.0222 8.8696 1.0377 1.0964 1.0861 1.1011 1.0643 1.0642
irintensity: 3.6854 0.3031 1.2753 0.2828 0.9703 0.1273 1.9267 0.7650 0.7762 1.5441 3.6101 1.6028 2.7954 4.0572 23.8965 25.9698 135.6910 116.6350 141.3222 50.8227 5.9920 4.9514 6.4022 12.2182 12.0685 222.7890 222.4139 111.3770 40.1953 14.0634 7.5989 1.1554 44.2109 72.3807 29.3193 20.2891 19.3591 230.1930 201.8328 3.3381 2.7692 3.0698 3.3853 59.3443 43.0951
temp: 298.150 k
press: 1.00000 atm
elementType: 35 35 8 8 8 8 6 6 6 6 6 1 1 1 1 1 1
symmnumber: 1
zpe: 286991.5 jmol-1
zpe.correction: 0.109309 hartree
zpe.thermalcorrener: 0.121897 hartree
zpe.thermalcorrenthalpy: 0.122841 hartree
zpe.thermalcorrgfe: 0.068217 hartree
zpe.sumelectzpe: -521.101623 hartree
zpe.sumelectthermal: -521.089035 hartree
zpe.sumelectthermalent: -521.088091 hartree
zpe.sumelectthermalfe: -521.142715 hartree
dipole: -0.3422 1.4432 0.5874
dipole: 1.5953
quadrupole: -73.7482 -79.2120 -85.6225
quadrupole: -1.4059 -2.5406 -1.4963
quadrupole: 5.7794 0.3155 -6.0950 -1.4059 -2.5406 -1.4963
hfenergy: -521.210932 hartree
pointgroup: C01 [X(C5H6Br2O4)]
dipole: -0.0857969 0.5173358 0.3448535 debye
dipolederiv: -0.3135357 -0.1865572 -0.1257009 -0.1931966 -0.338896 -0.1268417 -0.127587 -0.1096323 -0.1943985 -0.2097119 0.1361323 0.0337959 0.1461777 -0.2891491 -0.0418707 -0.0032142 -0.01343 -0.050574 -0.8589271 0.1650195 0.4884671 0.1450887 -0.3699845 -0.2018878 0.4472337 -0.205312 -0.7147112 -0.6914538 -0.2157548 0.4260367 -0.1930745 -0.4989527 0.3082833 0.4031411 0.3179797 -0.7769401 -0.5799878 0.1986503 0.1186389 -0.0820229 -0.7231411 0.3134616 0.3154831 0.1832502 -0.6119396 -0.4685972 -0.2322486 -0.0083312 -0.0940055 -0.5683114 -0.2529899 0.208321 -0.0922762 -0.8438536 0.5270055 0.3145415 0.2410423 0.5042381 0.0410213 0.135489 0.1804725 0.262539 0.3531505 0.3119718 -0.3636638 -0.0351993 -0.5549456 0.1420455 -0.0059488 -0.0902216 -0.1321744 -0.0769317 -0.1671083 -0.0444801 -0.0697085 -0.0851332 -0.0850726 -0.0655636 -0.0491014 -0.0224608 -0.2073552 0.8130476 -0.4604779 -0.6496977 -0.1425703 1.0709113 -0.1844027 -0.7091878 -0.1324144 0.9073389 0.7043094 0.6568275 -0.3653007 0.4480978 0.9657461 0.068156 -0.441799 0.0202772 1.3250123 0.0391303 0.0335652 -0.012164 0.0547905 0.0204883 0.0319208 0.0050895 -0.0069205 0.0581994 0.0993064 0.09074 -0.0125103 0.0820484 -0.0285543 0.0334749 -0.0215418 -0.0121168 0.101315 -0.0133435 -0.0186496 0.0920191 -0.0002176 0.1337183 0.0179229 0.07153 -0.0066385 0.069861 0.0983565 -0.04018 -0.0507322 -0.0113279 0.0750511 -0.0283016 -0.0954972 -0.050319 0.0768801 0.365385 0.0288056 -0.0180718 0.0638241 0.196528 0.0969247 -0.0336065 0.1300617 0.3136942 0.3441527 -0.0622697 -0.0525835 -0.0877712 0.2565518 -0.0978266 -0.0595144 -0.1304129 0.2712525 unknown
polarizability: 100.2996576|1.9969894|110.7449821|-4.2299624|7.5811327|81.2369868 unknown
InChI: InChI=1S/C5H6Br2O4/c1-5(7,4(10)11)2(6)3(8)9/h2,8,10H,1H3
charge 0 multiplicity 1
17 atoms
Br -1.861991 -1.932581 -0.582298
Br 1.797177 -2.039879 -0.540835
O  -2.42498 0.900757 1.119022
O  2.254423 1.196777 -1.333882
O  -1.251364 1.634582 -0.743919
O  1.584261 1.352487 0.885432
C  -0.627868 -0.520591 0.301414
C  0.619861 -0.390627 -0.606923
C  -0.386751 -0.934218 1.753929
C  -1.443795 0.777316 0.147985
C  1.511688 0.796334 -0.231318
H  0.335639 -0.30326 -1.664468
H  0.100636 -1.920371 1.795643
H  -1.340103 -0.972442 2.300235
H  0.274407 -0.187638 2.23035
H  -2.943029 1.736592 0.964681
H  2.83859 1.963764 -1.085648
