program: Gaussian 09
title: 000230403
version: EM64L-G09RevD.01
frameworkgroup: C1[X(C5H6Br2O4)]
method: RPBEPBE
basis: SDD
operation: Freq
keyword: #p
keyword: freq=noraman
keyword: PBEPBE/SDD
title: #p freq=noraman PBEPBE/SDD
converged: NO YES NO NO
title: Mulliken charges:
elementType: Br Br O O O O C C C C C H H H H H H
charge: 0.055190 0.057148 -0.392776 -0.391054 -0.198220 -0.201890 -0.215817 -0.559453 -0.641101 0.253797 0.263111 0.391528 0.286987 0.265612 0.240336 0.394931 0.391672
chargesum: 0.00000
title: Mulliken charges with hydrogens summed into heavy atoms:
elementType: Br Br O O O O C C C C C
charge: 0.055190 0.057148 0.002155 0.000618 -0.198220 -0.201890 -0.215817 -0.167925 0.151834 0.253797 0.263111
polarizability: 1.21285857e+02 1.60687163e+01 1.02002673e+02 -1.00132941e+00 -4.62083220e+00 7.98763858e+01
1716.lowfreq: -3.9519 -0.0008 -0.0007 -0.0001 4.8874 8.0720 49.3275 57.1647 65.0777
frequency: 49.3197 57.1572 65.0714 100.0382 121.6672 150.3053 175.5837 182.4070 227.4378 261.4394 270.6906 319.4334 337.4361 446.2912 496.0273 539.2654 550.4797 622.5117 624.3350 648.9070 709.8464 722.1634 788.2844 856.6390 963.8481 1032.2597 1045.6823 1061.6360 1138.0256 1173.5792 1236.1215 1264.3978 1312.6990 1362.0855 1400.1547 1458.7789 1469.4524 1643.5500 1662.4456 3008.5914 3108.4084 3125.1301 3147.3437 3517.6911 3523.1952
redmass: 8.7660 9.6015 12.0777 15.0817 15.0544 9.4010 9.7786 7.7045 1.3214 5.4675 2.5762 3.2511 7.5964 4.7012 4.0539 3.0277 3.6789 2.8121 1.3817 1.9102 6.1363 5.6936 4.3559 5.6216 2.5338 2.0582 2.6305 1.6774 1.8176 1.2828 3.1534 1.5815 2.4949 1.9209 1.1919 1.0586 1.0553 10.1398 8.8911 1.0394 1.0935 1.0866 1.1024 1.0642 1.0642
irintensity: 3.4045 0.2283 1.0990 0.2738 0.0955 1.4143 0.5048 3.1693 0.9060 0.5632 2.2948 3.6217 0.8604 8.7802 15.6622 10.5648 106.2892 26.2562 290.4141 40.8126 22.1998 0.2843 4.9832 0.9786 73.7267 52.3404 304.2764 110.2645 61.5921 23.9024 3.1770 1.4040 68.9976 42.3564 31.0939 25.1590 11.9249 255.4710 138.3545 3.5672 4.6619 6.5074 0.4958 48.6328 48.3105
temp: 298.150 k
press: 1.00000 atm
elementType: 35 35 8 8 8 8 6 6 6 6 6 1 1 1 1 1 1
symmnumber: 1
zpe: 286971.1 jmol-1
zpe.correction: 0.109302 hartree
zpe.thermalcorrener: 0.121987 hartree
zpe.thermalcorrenthalpy: 0.122932 hartree
zpe.thermalcorrgfe: 0.067927 hartree
zpe.sumelectzpe: -521.103338 hartree
zpe.sumelectthermal: -521.090652 hartree
zpe.sumelectthermalent: -521.089708 hartree
zpe.sumelectthermalfe: -521.144713 hartree
dipole: 0.4308 -0.5092 0.5650
dipole: 0.8741
quadrupole: -82.3235 -68.6843 -89.0674
quadrupole: -6.5495 -0.1173 -7.1794
quadrupole: -2.2984 11.3408 -9.0423 -6.5495 -0.1173 -7.1794
hfenergy: -521.2126398 hartree
pointgroup: C01 [X(C5H6Br2O4)]
dipole: 0.2374139 0.0397019 -0.24561 debye
dipolederiv: -0.2241156 0.0951786 0.0212332 0.0663093 -0.6911012 -0.0511937 0.0384724 -0.1077283 -0.1434128 -0.1818742 0.0771289 0.04156 0.0905143 -0.5571439 -0.153939 0.0428457 -0.10374 -0.096984 -0.9493471 -0.1522743 0.5010944 -0.1275997 -0.3814215 0.0840765 0.4202377 0.0933503 -0.5675458 -0.635485 -0.1693162 0.4940285 -0.1585411 -0.4591913 0.2366519 0.4381989 0.2121295 -0.8174687 -0.6491261 -0.0784133 -0.1742641 -0.0551574 -0.2730668 -0.0471224 0.074971 -0.0654888 -0.9077021 -0.6535449 -0.1008201 -0.2190691 -0.096056 -0.3110346 -0.0007262 0.0550586 0.0377554 -0.8790086 0.0851801 -0.2601844 -0.0742964 -0.1686299 0.7733785 -0.1046135 -0.1702807 -0.0499165 0.1994581 -0.0384734 -0.3259108 -0.0856094 -0.274438 0.6586701 0.2074167 -0.1481514 0.1454795 -0.0424338 -0.0972587 0.0146579 -0.003006 0.0056498 -0.1750642 0.0893056 0.0300769 0.0193959 -0.1811277 1.3459855 0.4152493 -0.1619033 0.3096818 0.2032158 0.0471233 -0.2496668 0.0800953 1.2378242 1.1471112 0.5027062 -0.1251817 0.3984509 0.3663121 -0.2094501 -0.2599702 -0.1704662 1.4234328 0.1287818 0.0097331 -0.002902 0.0291949 -0.0262498 0.000261 0.0234501 -0.0341371 0.0683004 0.0571487 -0.0397155 -0.0910005 -0.0269578 0.1007016 -0.0261612 -0.074037 0.0086198 0.1073173 0.0182803 0.048727 0.093848 0.0499119 0.1007273 -0.0317039 0.074774 -0.0128262 0.0663583 0.131018 0.0041523 -0.0062653 -0.0010199 -0.0746782 -0.0006105 -0.0117125 0.0058407 0.0778642 0.2912174 -0.0068768 -0.0984907 -0.0064819 0.374697 -0.0166368 -0.1426395 -0.0230341 0.193055 0.2245019 -0.0340219 -0.1097755 -0.0348312 0.371249 -0.0226778 -0.141627 -0.0353292 0.2620731 unknown
polarizability: 92.2596235|-1.0251901|127.7600858|-5.0697286|11.2926705|83.1452057 unknown
InChI: InChI=1S/C5H6Br2O4/c1-5(7,4(10)11)2(6)3(8)9/h2,8,10H,1H3
charge 0 multiplicity 1
17 atoms
Br 0.542399 -2.250601 -0.543372
Br -0.791495 2.181401 0.756226
O  2.89561 0.319502 -0.672168
O  -2.712392 -0.745663 1.228004
O  2.040181 0.176326 1.481051
O  -2.494191 -0.351827 -1.052148
C  0.525057 -0.154985 -0.455981
C  -0.624149 0.147256 0.518704
C  0.405773 0.369814 -1.885332
C  1.869244 0.128423 0.245154
C  -2.009847 -0.330992 0.097594
H  -0.380869 -0.199523 1.532604
H  -0.546119 0.044996 -2.330705
H  1.251797 0.016206 -2.491398
H  0.427124 1.474955 -1.871211
H  3.752242 0.458993 -0.18476
H  -3.631063 -1.028478 0.967137
