program: Gaussian 09
title: 000230402
version: EM64L-G09RevD.01
frameworkgroup: C1[X(C5H3ClO3)]
method: RPBEPBE
basis: SDD
operation: Freq
keyword: #p
keyword: freq=noraman
keyword: PBEPBE/SDD
title: #p freq=noraman PBEPBE/SDD
converged: NO NO NO NO
title: Mulliken charges:
elementType: Cl O O O C C C C C H H H
charge: 0.056692 -0.211712 -0.137438 -0.129948 0.417634 -0.389550 0.120445 -0.740259 0.241134 0.263037 0.263036 0.246929
chargesum: 0.00000
title: Mulliken charges with hydrogens summed into heavy atoms:
elementType: Cl O O O C C C C C
charge: 0.056692 -0.211712 -0.137438 -0.129948 0.417634 -0.389550 0.120445 0.032742 0.241134
polarizability: 1.06731898e+02 1.21124759e+01 7.59036115e+01 -8.23318079e-03 -8.59929282e-03 3.32177791e+01
1716.lowfreq: -13.0829 -7.7591 -0.0020 -0.0009 0.0001 12.4235 48.9274 101.7875 157.2154
frequency: 48.7694 101.7851 157.2069 186.9801 246.3751 249.8356 335.5713 426.6584 440.3802 564.1800 603.6751 638.7572 676.5964 724.2865 778.7780 828.4617 984.3366 1033.6440 1044.2819 1138.8190 1255.3978 1404.5266 1450.7745 1453.1732 1651.3432 1689.9823 1751.8607 2989.3895 3066.1611 3112.4580
redmass: 1.0629 5.2946 13.1474 7.0575 4.1434 5.8721 15.7564 11.4137 5.9287 7.6341 12.8568 6.9499 8.9906 8.8263 13.1848 4.3273 9.4613 1.5153 1.9922 11.2163 5.0646 1.2452 1.0431 1.0706 8.6424 13.0356 12.9256 1.0378 1.0962 1.0998
irintensity: 1.3620 1.1556 2.0422 1.7468 2.5447 0.1428 3.6574 6.8807 0.5622 16.6516 2.3284 3.6074 26.1238 1.2820 133.8714 12.1331 75.6615 3.1991 60.5999 70.6583 60.1174 34.6880 18.3315 11.4314 75.0598 505.3823 58.7251 0.9516 4.2119 5.4459
temp: 298.150 k
press: 1.00000 atm
elementType: 17 8 8 8 6 6 6 6 6 1 1 1
symmnumber: 1
zpe: 185627.2 jmol-1
zpe.correction: 0.070702 hartree
zpe.thermalcorrener: 0.079250 hartree
zpe.thermalcorrenthalpy: 0.080194 hartree
zpe.thermalcorrgfe: 0.036139 hartree
zpe.sumelectzpe: -877.398134 hartree
zpe.sumelectthermal: -877.389586 hartree
zpe.sumelectthermalent: -877.388642 hartree
zpe.sumelectthermalfe: -877.432696 hartree
dipole: 0.9571 -4.6502 0.0011
dipole: 4.7477
quadrupole: -67.8791 -60.5401 -55.5133
quadrupole: 0.6468 0.0010 0.0023
quadrupole: -6.5683 0.7708 5.7976 0.6468 0.0010 0.0023
hfenergy: -877.4688359 hartree
pointgroup: C01 [X(C5H3Cl1O3)]
dipole: 0.4383151 -1.8157455 -0.0004321 debye
dipolederiv: -0.3732698 -0.2859578 0.000021 -0.4174 -0.3787547 0.0000154 0.0000039 0.0000035 0.0326248 -1.1680252 0.1183523 0.0001861 0.0387644 -0.7581275 -0.0000397 0.0000768 -0.0002043 -0.2105559 -1.0830475 -0.1278048 0.0001567 -0.2573954 -0.4926148 0.0000336 0.0000903 -0.0000038 -0.2873254 -0.9213823 0.2102215 0.000001 0.3120515 -0.513524 -0.000013 0.0002414 -0.000106 -0.2922993 -0.1019156 -0.5167585 -0.0000082 -0.6448044 -0.1143733 0.0000406 -0.0000628 0.0000552 0.0076178 0.4938144 0.7988515 -0.0000089 0.8280002 0.1870841 -0.0001239 0.000008 -0.0000249 -0.0755217 1.6435744 0.0330451 -0.0003319 0.290199 1.0387967 0.0000485 -0.0002704 0.0001338 0.285263 -0.1902927 0.1813149 0.0000413 0.1068514 -0.104122 -0.0000145 0.0000387 -0.000032 0.0331208 1.4848774 -0.3022503 -0.0000405 -0.297513 0.993394 0.0000633 -0.0001219 0.0001635 0.3627024 0.0894785 -0.0006467 -0.0838595 0.0296267 0.0846936 -0.033458 -0.0853541 0.0010402 0.0094452 0.0895012 -0.0006636 0.0838533 0.0296115 0.0846879 0.0334681 0.0853446 -0.0010165 0.0094473 0.036687 -0.1077036 -0.0000104 -0.0179919 -0.02714 -0.0000204 0.0000055 -0.0000087 0.125481 unknown
polarizability: 110.4756537|4.1572578|72.1598558|-0.0111111|0.004275|33.2177791 unknown
InChI: InChI=1S/C5H3ClO3/c1-2-3(6)5(8)9-4(2)7/h1H3
charge 0 multiplicity 1
12 atoms
Cl -1.933005 -1.90874 -0.000007
O  0.118075 1.586069 0.000317
O  2.395873 0.988798 -0.000338
O  -2.226191 1.346325 0.000509
C  0.646692 -0.759953 -0.000245
C  -0.711864 -0.628252 -0.000084
C  1.215378 0.631209 -0.000172
C  1.519407 -1.972364 -0.0004
C  -1.112114 0.823108 0.000039
H  2.182315 -1.972332 0.884828
H  2.182254 -1.972141 -0.885674
H  0.925181 -2.900227 -0.000475
