program: Gaussian 09
title: 000230401
version: EM64L-G09RevD.01
frameworkgroup: C1[X(C4H3BrO3)]
method: RPBEPBE
basis: SDD
operation: Freq
keyword: #p
keyword: freq=noraman
keyword: PBEPBE/SDD
title: #p freq=noraman PBEPBE/SDD
converged: YES YES NO NO
title: Mulliken charges:
elementType: Br O O O C C C C H H H
charge: 0.084169 -0.199105 -0.128179 -0.138480 -0.569696 -0.495117 0.270755 0.237780 0.344757 0.285960 0.307156
chargesum: 0.00000
title: Mulliken charges with hydrogens summed into heavy atoms:
elementType: Br O O O C C C C
charge: 0.084169 -0.199105 -0.128179 -0.138480 -0.224939 0.097999 0.270755 0.237780
polarizability: 7.74661010e+01 5.58066469e+00 6.53800241e+01 -3.72457458e+00 2.04623882e+00 4.53215011e+01
1716.lowfreq: -7.2363 -0.0005 0.0006 0.0007 5.1639 9.0504 50.2870 136.3609 154.4341
frequency: 50.1952 136.3583 154.4319 265.7332 361.9802 470.1786 506.0667 546.7058 587.0105 652.5111 697.8889 777.5751 814.4764 931.3371 1004.4920 1024.0042 1101.7332 1146.9209 1191.9771 1244.7459 1291.7274 1427.1074 1708.5123 1779.9871 3012.3081 3115.4590 3130.5393
redmass: 7.5792 15.8524 15.1548 3.2481 12.2164 4.3287 3.5106 5.6095 10.2272 7.0486 5.7464 8.6003 11.3769 2.2930 3.2733 2.6311 3.8698 1.2839 1.2118 1.6319 1.4583 1.0744 12.8466 12.7062 1.0678 1.0951 1.0890
irintensity: 3.3995 1.8193 2.0548 6.3225 10.5458 12.7534 1.6637 22.4497 3.4951 71.5915 2.4738 9.4886 244.0737 50.3240 104.9815 116.9768 102.6962 25.7057 11.5831 4.2631 2.6217 28.8689 495.4894 99.3754 0.9332 0.1931 1.1975
temp: 298.150 k
press: 1.00000 atm
elementType: 35 8 8 8 6 6 6 6 1 1 1
symmnumber: 1
zpe: 174247.8 jmol-1
zpe.correction: 0.066367 hartree
zpe.thermalcorrener: 0.073599 hartree
zpe.thermalcorrenthalpy: 0.074543 hartree
zpe.thermalcorrgfe: 0.032642 hartree
zpe.sumelectzpe: -392.759846 hartree
zpe.sumelectthermal: -392.752615 hartree
zpe.sumelectthermalent: -392.751671 hartree
zpe.sumelectthermalfe: -392.793572 hartree
dipole: 1.5376 -2.3004 3.7901
dipole: 4.6926
quadrupole: -64.0022 -62.7451 -50.3282
quadrupole: -1.9153 -6.2773 -0.3004
quadrupole: -4.9770 -3.7199 8.6970 -1.9153 -6.2773 -0.3004
hfenergy: -392.8262136 hartree
pointgroup: C01 [X(C4H3Br1O3)]
dipole: 0.1449771 -1.3757059 1.2226899 debye
dipolederiv: -0.1888792 0.0780219 0.0820229 0.1331806 -0.1992525 -0.0889028 0.1449484 -0.0901715 -0.1749432 -1.7230239 -0.4083282 -0.1356104 -0.4678136 -0.6963607 0.0573098 -0.2488887 0.1095935 -0.2443934 -0.8267009 -0.3090994 -0.0973783 -0.331002 -0.7443937 -0.0561706 -0.0843669 0.0573641 -0.2775502 -1.1501145 -0.07986 -0.145376 -0.0458197 -0.4318679 0.0475404 -0.261353 0.0483355 -0.3568427 0.258184 -0.1119009 -0.2083921 -0.046863 -0.1021254 0.2147594 -0.3252939 0.2699676 0.3913666 -0.1665437 0.0574372 -0.0575712 0.0356822 -0.2316562 0.1383242 -0.0186678 0.1582374 -0.1228016 1.8171412 0.4437924 0.2664354 -0.0162962 1.1311916 0.0148472 0.560555 -0.1489758 0.2262122 1.8425362 0.2549429 0.2511141 0.7015056 1.0509195 -0.1946584 0.2375864 -0.3247601 0.4450405 0.015179 0.0398107 0.012369 0.0322125 0.0615107 -0.0643662 -0.0136249 -0.0315423 -0.029077 0.0289534 0.0421129 0.0531708 0.0289679 0.1367778 -0.0399981 0.0297234 -0.0042196 0.0093266 0.0932684 -0.0069296 -0.0207842 -0.0237543 0.0252567 -0.0286851 -0.020618 -0.0438288 0.1336622 unknown
polarizability: 78.5112343|-1.7282163|61.3817583|-5.1760473|7.2889899|48.2746336 unknown
InChI: InChI=1S/C4H3BrO3/c5-2-1-3(6)8-4(2)7/h2H,1H2
charge 0 multiplicity 1
11 atoms
Br 1.80263 -1.717777 -0.837107
O  -0.541064 1.094764 -0.339284
O  1.677916 1.665155 0.141774
O  -2.583362 -0.043754 -0.453926
C  0.835977 -0.650524 0.59816
C  -0.631156 -1.073571 0.72804
C  0.790107 0.814363 0.135738
C  -1.414173 -0.035703 -0.078183
H  1.457261 -0.774419 1.49471
H  -0.964786 -1.011008 1.782106
H  -0.85195 -2.089127 0.368972
