program: Gaussian 09
title: 000230397
version: EM64L-G09RevD.01
frameworkgroup: C1[X(C8H13NO6)]
method: RPBEPBE
basis: SDD
operation: Freq
keyword: #p
keyword: freq=noraman
keyword: PBEPBE/SDD
title: #p freq=noraman PBEPBE/SDD
converged: YES YES NO NO
title: Mulliken charges:
elementType: O O O O O O N C C C C C C C C H H H H H H H H H H H H H
charge: -0.203996 -0.481008 -0.488769 -0.204936 -0.435484 -0.331204 -0.403803 -0.099417 -0.120613 -0.240601 -0.110280 0.174857 -0.333361 0.319120 -0.772241 0.291432 0.236572 0.312589 0.208414 0.346828 0.211260 0.228329 0.398617 0.389876 0.356088 0.262813 0.262410 0.226508
chargesum: 0.00000
title: Mulliken charges with hydrogens summed into heavy atoms:
elementType: O O O O O O N C C C C C C C C
charge: -0.203996 -0.082392 -0.098893 -0.204936 -0.079395 -0.331204 -0.056975 0.192014 0.115960 0.071989 0.098134 0.174857 0.106228 0.319120 -0.020509
polarizability: 1.41538177e+02 4.40258747e+00 1.14707909e+02 1.56191826e+00 3.99836901e+00 7.72164054e+01
1716.lowfreq: -5.6659 -0.0011 -0.0008 -0.0007 3.5491 7.6381 48.2196 53.8463 74.9867
frequency: 48.1742 53.8208 74.9708 89.2145 103.4829 114.5852 141.9982 149.9465 187.3849 228.0784 255.2361 282.8773 319.2458 325.7621 359.2817 388.9971 420.8819 477.4022 509.9127 527.9869 558.3306 573.5809 591.3926 604.2460 653.3851 661.8161 674.2381 710.2790 818.2318 854.2856 876.0175 902.3934 931.8325 954.2033 985.4918 999.0263 1014.1023 1033.7798 1048.9252 1059.2799 1086.3616 1096.9494 1129.8159 1173.3302 1188.6890 1192.3633 1220.0308 1256.4480 1278.9787 1283.8455 1292.9294 1314.7250 1330.1953 1353.7914 1364.6720 1383.0030 1395.9879 1412.9005 1437.2344 1449.5253 1464.8168 1466.1422 1495.5037 1591.4235 1703.8295 2947.8706 2962.9258 2970.5555 2987.5773 3004.6193 3043.8234 3091.9886 3101.3723 3112.9858 3126.2554 3343.8315 3494.8459 3495.1116
redmass: 4.7414 6.3427 1.2123 4.3054 5.4187 7.6734 4.6229 5.3095 3.5923 5.0905 7.5588 4.3418 4.0908 5.3450 5.1110 3.6364 4.0063 5.9513 3.6478 1.1735 3.4123 1.5209 3.1416 3.8004 1.2537 3.2215 5.5714 4.0435 1.0759 5.7625 3.5246 2.6881 6.5445 4.7122 3.7442 1.7129 2.9428 3.5362 1.6563 3.9015 4.6559 3.1975 1.7151 2.5538 1.4747 1.4532 1.2572 1.2249 1.5628 1.2515 1.2854 1.2916 1.2868 1.2618 1.3260 1.2340 1.2256 1.5735 1.5567 1.0524 1.1389 1.0842 2.2541 4.9868 11.7822 1.0813 1.0836 1.0751 1.0768 1.0363 1.0854 1.0971 1.0979 1.1006 1.0667 1.0688 1.0781 1.0645
irintensity: 0.4748 0.8435 0.2116 8.9230 2.5838 16.4832 1.4652 4.1600 15.6552 3.6237 4.2688 12.8020 1.0855 9.5888 8.0186 24.3887 1.6330 15.5566 8.1146 206.9776 10.2899 75.0988 7.2161 58.7752 96.9490 11.7525 1.8245 4.4110 145.7981 7.0773 25.0121 41.8208 83.3979 18.4826 59.1147 12.1179 28.2402 17.4755 16.4853 2.5512 157.6933 102.7322 67.3137 14.8040 32.5937 14.0713 1.7382 12.4434 21.6725 11.0677 36.4538 47.9101 8.4448 116.2272 21.5854 32.0621 50.1085 90.2697 127.1180 20.5674 74.1373 0.9078 192.7796 135.9902 294.6752 14.8063 22.9855 22.3455 96.8518 5.6983 13.5045 15.4675 6.6458 28.7655 580.3851 156.0388 52.8541 19.8880
temp: 298.150 k
press: 1.00000 atm
elementType: 8 8 8 8 8 8 7 6 6 6 6 6 6 6 6 1 1 1 1 1 1 1 1 1 1 1 1 1
symmnumber: 1
zpe: 571882.8 jmol-1
zpe.correction: 0.217819 hartree
zpe.thermalcorrener: 0.233028 hartree
zpe.thermalcorrenthalpy: 0.233972 hartree
zpe.thermalcorrgfe: 0.175024 hartree
zpe.sumelectzpe: -817.571583 hartree
zpe.sumelectthermal: -817.556374 hartree
zpe.sumelectthermalent: -817.555429 hartree
zpe.sumelectthermalfe: -817.614377 hartree
dipole: 5.5715 -0.0717 1.4149
dipole: 5.7488
quadrupole: -84.0772 -106.4679 -86.9898
quadrupole: 3.1096 -2.9692 0.3501
quadrupole: 8.4344 -13.9562 5.5218 3.1096 -2.9692 0.3501
hfenergy: -817.7894012 hartree
pointgroup: C01 [X(C8H13N1O6)]
dipole: 2.1368532 0.0309876 0.7405676 debye
polarizability: 141.2781822|4.1402182|114.0581102|5.9601473|-5.0567838|78.1261993 unknown
InChI: InChI=1S/C8H13NO6/c1-3(11)9-5-6(13)7(4(12)2-10)15-8(5)14/h4-7,9-10,12-13H,2H2,1H3
charge 0 multiplicity 1
28 atoms
O  -1.067515 1.614463 -0.367178
O  -0.154445 -1.90883 0.052474
O  -2.836855 -1.509227 0.816011
O  0.927046 2.813406 -0.559286
O  -4.258005 -0.286906 -1.176906
O  2.470599 -1.897762 0.435473
N  2.295861 0.392961 0.110894
C  -1.415664 0.147222 -0.251133
C  -0.119607 -0.485053 0.304381
C  0.952271 0.321466 -0.464157
C  -2.635528 -0.056444 0.651928
C  0.321685 1.732233 -0.490331
C  -3.939445 0.474524 0.029998
C  2.997685 -0.731345 0.478991
C  4.428671 -0.526928 0.940297
H  -1.628806 -0.235953 -1.266598
H  -0.022445 -0.267679 1.391861
H  0.986544 -0.081356 -1.500257
H  -2.45215 0.428465 1.634003
H  2.730129 1.322104 0.134944
H  -4.751893 0.394739 0.780871
H  -3.82533 1.526793 -0.277345
H  0.79886 -2.232318 0.194049
H  -1.970017 -1.999386 0.695333
H  -4.193965 -1.243162 -0.906426
H  4.562928 -1.003992 1.92535
H  5.110533 -1.03613 0.23719
H  4.716962 0.534995 1.009868
