program: Gaussian 09
title: 000230395
version: EM64L-G09RevD.01
frameworkgroup: C1[X(C14H18O12)]
method: RPBEPBE
basis: SDD
operation: Freq
keyword: #p
keyword: freq=noraman
keyword: PBEPBE/SDD
title: #p freq=noraman PBEPBE/SDD
converged: YES YES NO NO
title: Mulliken charges:
elementType: O O O O O O O O O O O O C C C C C C C C C C C C C C H H H H H H H H H H H H H H H H H H
charge: -0.279156 -0.294119 -0.260230 -0.252164 -0.414157 -0.417570 -0.220607 -0.192065 -0.228682 -0.233492 -0.248532 -0.234330 -0.110575 -0.077863 -0.164177 -0.119204 0.171731 0.183711 0.319790 0.356536 0.326691 0.316682 -0.773857 -0.780111 -0.756862 -0.760901 0.339681 0.312445 0.323556 0.292731 0.253038 0.243348 0.278194 0.243623 0.244412 0.291051 0.392575 0.390811 0.277191 0.243531 0.255455 0.245763 0.262684 0.253423
chargesum: 0.00000
title: Mulliken charges with hydrogens summed into heavy atoms:
elementType: O O O O O O O O O O O O C C C C C C C C C C C C C C
charge: -0.279156 -0.294119 -0.260230 -0.252164 -0.021582 -0.026759 -0.220607 -0.192065 -0.228682 -0.233492 -0.248532 -0.234330 0.229106 0.234582 0.159380 0.173528 0.171731 0.183711 0.319790 0.356536 0.326691 0.316682 0.000722 -0.001025 0.019315 0.000969
polarizability: 1.81773268e+02 -6.21371540e+00 2.05091127e+02 2.83615386e+00 4.16992156e+00 1.77175224e+02
1716.lowfreq: -11.0725 -6.5731 0.0005 0.0008 0.0011 4.9003 16.8558 29.1466 35.9953
frequency: 16.5894 29.1063 35.9901 40.2134 52.9679 54.9132 60.4307 65.3450 69.7388 72.3070 77.9976 82.7590 84.7166 90.7544 93.2316 100.9717 102.2878 122.9014 127.3831 133.6025 148.4749 181.2637 189.7901 195.9372 199.3413 252.6027 274.5458 284.5920 292.4545 312.2352 328.0555 343.2520 385.5747 407.5497 439.4762 474.8743 477.6195 503.5837 529.0384 551.4638 557.3578 559.3809 564.1847 568.0661 590.6575 597.5330 613.2898 616.9338 635.9687 645.7650 661.4710 685.2961 723.9510 794.8775 826.0968 836.4490 857.5813 897.8246 908.5765 952.5200 969.3337 976.1641 980.7654 992.6476 993.6648 999.9531 1006.7894 1030.8822 1043.5649 1044.0011 1047.1767 1047.9158 1051.8381 1073.5970 1104.4159 1146.6324 1174.0162 1178.3922 1188.7777 1202.2144 1215.7212 1246.4169 1254.2956 1273.4193 1297.0406 1309.2289 1321.3313 1335.2471 1341.4463 1369.5836 1383.2669 1386.0154 1386.7280 1388.5804 1451.2696 1452.1015 1452.2116 1452.3197 1453.0838 1455.6746 1456.7689 1458.9904 1658.6348 1661.1620 1662.6165 1674.9153 1683.4502 1684.7595 3000.8970 3002.3697 3003.3799 3007.2041 3008.1486 3046.9271 3057.9724 3073.2559 3092.3391 3096.6683 3097.4685 3100.6401 3141.0496 3142.1812 3143.5886 3145.4997 3524.8234 3527.3147
redmass: 6.0482 5.1548 5.0413 4.6718 3.1396 1.7230 5.1753 4.4657 5.6343 4.6304 4.6417 6.6155 5.2793 3.7873 6.5096 1.2412 3.7035 1.3044 1.0603 3.9475 6.3380 7.5752 6.6446 6.5770 7.6865 4.3581 8.2844 7.2086 7.8795 6.6059 4.7269 4.6631 4.1995 4.6572 4.2211 4.2786 3.4477 4.0526 3.0925 3.2145 2.6747 3.0940 3.2994 2.1223 4.4931 2.4238 2.9430 3.6179 3.5664 3.3112 4.4959 4.3266 4.7540 6.3387 6.1428 6.1363 6.5043 5.4671 5.8460 4.8399 4.5313 3.8458 3.3286 2.5621 2.2154 2.0844 2.9295 3.2955 1.6801 1.6700 1.6507 1.6875 2.4606 2.6922 3.7240 2.9889 3.0016 2.8479 2.9113 2.9374 1.5786 1.3262 1.4118 1.4952 1.2634 1.5929 1.7089 1.3373 1.5044 1.4781 1.2521 1.2439 1.2448 1.2400 1.0492 1.0560 1.0521 1.0502 1.0566 1.0590 1.0567 1.0541 10.0341 9.7472 10.0280 9.7165 9.5623 9.9561 1.0386 1.0802 1.0381 1.0374 1.0382 1.0842 1.0842 1.0846 1.0959 1.0962 1.0945 1.0944 1.1022 1.1011 1.1023 1.1018 1.0644 1.0643
irintensity: 0.0961 0.3416 0.7305 0.6376 0.4691 0.6052 0.5211 0.7135 0.8300 4.6491 6.3798 0.5712 6.0563 8.5118 1.4846 0.1423 1.5645 1.0800 0.4509 3.6383 3.8370 3.3676 7.5520 1.9429 1.9829 2.3203 2.3771 0.6323 0.7978 2.2603 6.3609 1.7007 15.1428 13.3681 23.1630 9.7783 50.3284 2.2606 8.1926 8.2027 17.3464 28.8509 10.4532 108.4255 2.1094 34.0347 70.8959 1.8133 73.0904 50.0386 36.3576 45.3437 3.3086 67.5227 13.4221 31.4079 4.3344 15.7778 46.5099 34.2447 134.9085 21.5671 50.1746 153.3833 11.9560 179.0768 139.3755 180.4722 5.2026 11.5949 4.9669 31.4564 181.9212 36.7055 7.2570 16.2264 291.1538 171.8917 555.1199 132.9259 20.0594 7.9543 11.9252 17.3065 3.5710 40.7349 8.8696 2.5584 15.4170 14.3222 77.8992 58.5171 54.5429 73.3123 30.0925 10.5455 17.1092 3.0196 22.9210 19.1297 42.2467 18.2515 82.6408 246.4508 209.1545 234.6868 22.4514 285.5658 4.5079 18.7696 0.8289 1.0567 0.6150 6.6602 5.7766 4.7628 3.3502 2.6584 4.0252 5.7266 8.2806 8.1137 7.6789 6.6962 36.9991 42.1441
temp: 298.150 k
press: 1.00000 atm
elementType: 8 8 8 8 8 8 8 8 8 8 8 8 6 6 6 6 6 6 6 6 6 6 6 6 6 6 1 1 1 1 1 1 1 1 1 1 1 1 1 1 1 1 1 1
symmnumber: 1
zpe: 837448.5 jmol-1
zpe.correction: 0.318967 hartree
zpe.thermalcorrener: 0.348615 hartree
zpe.thermalcorrenthalpy: 0.349559 hartree
zpe.thermalcorrgfe: 0.254647 hartree
zpe.sumelectzpe: -1445.014378 hartree
zpe.sumelectthermal: -1444.984731 hartree
zpe.sumelectthermalent: -1444.983786 hartree
zpe.sumelectthermalfe: -1445.078699 hartree
dipole: 0.2997 -1.7462 -0.1039
dipole: 1.7748
quadrupole: -157.5037 -138.8235 -144.7963
quadrupole: -4.9280 2.2200 -5.3245
quadrupole: -10.4625 8.2176 2.2449 -4.9280 2.2200 -5.3245
hfenergy: -1445.3333452 hartree
pointgroup: C01 [X(C14H18O12)]
dipole: 0.1306872 0.5900561 -0.3497442 debye
polarizability: 179.0778262|0.5937261|198.6153259|-5.2576424|-12.7499803|186.3464664 unknown
InChI: InChI=1S/C14H18O12/c1-5(15)23-9(11(13(19)20)25-7(3)17)10(24-6(2)16)12(14(21)22)26-8(4)18/h9-12,19,21H,1-4H3
charge 0 multiplicity 1
44 atoms
O  0.042209 -1.958442 0.386548
O  0.182985 1.616938 -0.284979
O  2.251668 -0.377709 -0.807373
O  -2.624379 1.19908 -0.677199
O  1.858236 1.170898 2.455299
O  -2.257902 -0.931027 2.249352
O  3.259679 1.722644 0.683451
O  -3.434923 -1.354283 0.282557
O  0.831451 -2.763492 2.430305
O  0.283167 1.309407 -2.610917
O  2.900546 -2.619709 -0.66182
O  -4.29199 1.799725 0.834432
C  0.391286 -0.575462 0.806587
C  -0.476317 0.304925 -0.123236
C  1.911187 -0.364402 0.621283
C  -1.884136 0.589987 0.441617
C  2.421399 0.957892 1.19508
C  -2.625781 -0.66681 0.928624
C  0.362403 -2.994003 1.296854
C  0.53601 2.005118 -1.611549
C  2.733834 -1.590034 -1.348421
C  -3.870715 1.770426 -0.3408
C  0.090902 -4.335738 0.669619
C  1.254989 3.328247 -1.567347
C  3.005666 -1.408444 -2.820023
C  -4.563949 2.278967 -1.578579
H  0.150722 -0.447345 1.875726
H  -0.561479 -0.175851 -1.114818
H  2.431981 -1.194301 1.141184
H  -1.819733 1.296137 1.288498
H  -0.82506 -4.311583 0.057912
H  0.020083 -5.109061 1.4486
H  0.938578 -4.577692 0.001774
H  0.680115 4.063276 -0.979591
H  1.415291 3.699778 -2.589515
H  2.229515 3.187099 -1.064942
H  2.22449 2.008223 2.848379
H  -2.723961 -1.744407 2.582737
H  2.175135 -0.85963 -3.294292
H  3.151069 -2.387983 -3.297398
H  3.919517 -0.801529 -2.952846
H  -5.330233 3.017431 -1.30088
H  -5.056904 1.430105 -2.086821
H  -3.840248 2.714436 -2.285375
