program: Gaussian 09
title: 000230393
version: EM64L-G09RevD.01
frameworkgroup: C1[X(C12H18O8)]
method: RPBEPBE
basis: SDD
operation: Freq
keyword: #pfreq=noraman
keyword: PBEPBE/SDD
title: #p freq=noraman PBEPBE/SDD
converged: YES YES NO NO
title: Mulliken charges:
elementType: O O O O O O O O C C C C C C C C C C C C H H H H H H H H H H H H H H H H H H
charge: -0.273410 -0.273418 -0.259742 -0.259749 -0.263640 -0.263654 -0.268824 -0.268830 -0.062097 -0.062126 -0.345232 -0.345220 0.327996 0.328066 0.326111 0.326099 -0.768067 -0.768061 -0.760411 -0.760429 0.290300 0.290282 0.241987 0.268234 0.268237 0.241979 0.247817 0.241732 0.286554 0.286493 0.241744 0.247820 0.279123 0.243008 0.248591 0.248614 0.243014 0.279109
chargesum: 0.00000
title: Mulliken charges with hydrogens summed into heavy atoms:
elementType: O O O O O O O O C C C C C C C C C C C C
charge: -0.273410 -0.273418 -0.259742 -0.259749 -0.263640 -0.263654 -0.268824 -0.268830 0.228202 0.228156 0.164988 0.164997 0.327996 0.328066 0.326111 0.326099 0.008036 0.007997 0.010312 0.010308
polarizability: 1.97441902e+02 1.63057286e+01 1.35048493e+02 6.75411208e+00 -1.19049950e+01 1.33393504e+02
1716.lowfreq: -0.0008 -0.0005 -0.0004 2.8559 8.8995 15.3550 38.8642 46.0755 55.0921
frequency: 38.8642 46.0755 55.0921 55.3185 66.0304 72.2845 77.6104 79.0702 90.0145 90.4701 112.0329 124.5220 124.8808 133.7574 134.3165 144.5933 178.7318 186.6029 226.2001 233.9252 246.7684 273.6856 291.9839 339.2339 360.7682 416.4657 418.3846 460.1539 482.4478 548.0227 557.3916 561.5775 568.7293 580.3007 593.7216 607.7958 609.2616 635.7439 663.0512 777.5219 778.7079 797.8355 822.5035 885.1414 901.7681 923.2542 943.7028 990.8175 999.4196 1002.2858 1004.9939 1012.3703 1038.3463 1048.2265 1048.4615 1048.7056 1050.4477 1068.1042 1083.3153 1157.9144 1179.5927 1181.0211 1191.7376 1214.6093 1219.9451 1240.5210 1265.5574 1327.1321 1331.2478 1350.9019 1361.0206 1383.4947 1383.9793 1385.3450 1386.9150 1388.6229 1452.9932 1453.0587 1454.3942 1455.0126 1456.6223 1457.4380 1457.8749 1458.2232 1459.8093 1459.8897 1644.1391 1645.1740 1648.5033 1652.5698 3003.4888 3003.4951 3003.9878 3003.9944 3028.5609 3030.6615 3039.2356 3048.2115 3100.5705 3100.5790 3101.1213 3101.1522 3104.0743 3104.5743 3142.2428 3142.2549 3142.5336 3142.5560
redmass: 5.6381 5.1923 5.9972 7.4491 5.4554 4.8161 6.2952 8.2518 3.6490 3.5671 3.4051 1.0269 1.0252 1.0514 1.0564 6.4345 4.1863 8.7167 7.1103 6.1553 9.9272 4.2562 2.7328 2.5417 3.2773 3.5081 3.0251 2.8912 3.5771 3.8798 3.3788 3.3586 3.3545 4.4668 4.8321 4.5029 4.9850 4.0118 4.6742 4.0678 4.9671 4.1568 3.6463 5.1780 4.4600 5.9750 5.9735 1.9618 1.9497 1.8596 1.8571 3.1006 2.3468 1.6404 1.6447 1.6394 1.7053 3.0491 2.7147 2.4232 2.8786 2.7818 2.8348 3.6847 1.3777 1.0896 1.3054 1.2788 1.4743 1.4667 1.2487 1.2938 1.2303 1.2657 1.2415 1.3352 1.0586 1.0601 1.0607 1.0591 1.0626 1.0570 1.0558 1.0663 1.0688 1.0666 9.7445 9.7502 9.6951 9.3007 1.0388 1.0388 1.0389 1.0389 1.0662 1.0594 1.0752 1.0813 1.0929 1.0929 1.0933 1.0933 1.1072 1.1072 1.1028 1.1028 1.1028 1.1028
irintensity: 0.5213 0.5504 5.1337 0.0087 0.0000 0.3179 1.6216 0.0000 20.6227 0.4624 0.0001 0.0131 0.7502 1.0514 0.0121 2.2325 27.0077 0.0000 0.0000 0.0000 0.9480 0.0000 34.9777 0.0000 9.6210 23.7985 0.0000 15.9196 0.0000 2.9818 0.0000 0.0000 4.7399 28.9068 0.0000 10.8175 0.0004 13.0381 0.0000 0.0000 25.6073 40.5935 0.0000 0.0000 28.1439 0.0000 293.5688 0.0000 103.7895 135.8104 0.0000 0.0000 81.0029 0.0998 38.6531 0.0541 57.1258 18.4695 0.0000 0.0000 0.0001 40.2829 1037.2435 0.0000 200.2216 0.0000 0.5467 9.1877 0.0000 0.0000 2.8520 0.0418 136.0683 0.0134 143.2444 0.0001 0.0080 87.2824 24.4758 0.0001 21.7029 0.0009 43.4424 0.0001 0.0067 12.5359 222.4128 0.0163 456.3711 0.0022 0.3077 4.7594 0.3106 0.1644 0.0001 44.9598 0.0000 9.9563 14.3910 3.8630 8.4254 0.0000 0.0005 11.9737 0.0629 11.4774 16.1351 0.8571
temp: 298.150 k
press: 1.00000 atm
elementType: 8 8 8 8 8 8 8 8 6 6 6 6 6 6 6 6 6 6 6 6 1 1 1 1 1 1 1 1 1 1 1 1 1 1 1 1 1 1
symmnumber: 1
zpe: 772550.5 jmol-1
zpe.correction: 0.294249 hartree
zpe.thermalcorrener: 0.317399 hartree
zpe.thermalcorrenthalpy: 0.318343 hartree
zpe.thermalcorrgfe: 0.240317 hartree
zpe.sumelectzpe: -1068.332041 hartree
zpe.sumelectthermal: -1068.308891 hartree
zpe.sumelectthermalent: -1068.307946 hartree
zpe.sumelectthermalfe: -1068.385973 hartree
dipole: -0.0008 0.0001 -0.0004
dipole: 0.0009
quadrupole: -119.2844 -106.6158 -121.8240
quadrupole: -1.7459 2.7836 -6.0500
quadrupole: -3.3763 9.2922 -5.9159 -1.7459 2.7836 -6.0500
hfenergy: -1068.6262896 hartree
pointgroup: C01 [X(C12H18O8)]
dipole: -0.0002684 0.0001549 0.0001605 debye
polarizability: 157.5390584|-35.1677913|173.4005467|-11.945201|-5.7656228|134.9442946 unknown
InChI: InChI=1S/C12H18O8/c1-7(13)17-5-11(19-9(3)15)12(20-10(4)16)6-18-8(2)14/h11-12H,5-6H2,1-4H3
charge 0 multiplicity 1
38 atoms
O  0.044356 1.803307 -0.42018
O  -0.027168 -1.800288 0.423851
O  2.589242 0.234071 -0.074567
O  -2.571804 -0.230512 0.077449
O  -1.153849 2.883462 1.273148
O  1.171401 -2.880723 -1.269044
O  3.370378 -1.631526 1.101716
O  -3.353041 1.634337 -1.099972
C  0.197267 0.600586 0.447953
C  -0.179739 -0.597616 -0.444419
C  1.616744 0.528853 1.009928
C  -1.599085 -0.525741 -1.006729
C  -0.694205 2.883002 0.108782
C  0.711487 -2.880075 -0.104784
C  3.402593 -0.903519 0.082778
C  -3.385105 0.907028 -0.08053
C  -0.868066 3.959312 -0.930854
C  0.88449 -3.956544 0.934837
C  4.244512 -1.125957 -1.14844
C  -4.227625 1.129728 1.150226
H  -0.505001 0.690037 1.297536
H  0.522706 -0.687229 -1.29384
H  1.902912 1.502756 1.439461
H  1.684702 -0.261477 1.777591
H  -1.666728 0.264409 -1.774607
H  -1.885325 -1.499698 -1.436086
H  -0.013608 3.985348 -1.623978
H  -1.006806 4.935815 -0.443024
H  -1.780266 3.723157 -1.51024
H  1.796525 -3.72078 1.514646
H  1.023073 -4.933059 0.446986
H  0.029727 -3.982323 1.627595
H  3.690491 -1.807251 -1.821233
H  5.192906 -1.611228 -0.871607
H  4.429414 -0.182052 -1.682392
H  -4.412372 0.186018 1.684579
H  -5.176101 1.61449 0.872778
H  -3.674127 1.811581 1.822883
