program: Gaussian 09
title: 000230391
version: EM64L-G09RevD.01
frameworkgroup: C1[X(C14H20N2O5)]
method: RPBEPBE
basis: SDD
operation: Freq
keyword: #p
keyword: freq=noraman
keyword: PBEPBE/SDD
title: #p freq=noraman PBEPBE/SDD
converged: YES YES NO NO
title: Mulliken charges:
elementType: O O O O O N N C C C C C C C C C C C C C C H H H H H H H H H H H H H H H H H H H H
charge: -0.485780 -0.425507 -0.428650 -0.534189 -0.452582 -0.316895 -0.019165 -0.188491 -0.197122 -0.105842 -0.089155 -0.077517 -0.386611 -0.504159 -0.208199 0.433771 -0.373560 -0.443033 -0.222560 -0.220897 -0.241735 0.224726 0.277868 0.240309 0.295058 0.247916 0.277770 0.244521 0.219595 0.205816 0.229913 0.400508 0.347661 0.351518 0.386227 0.356962 0.269671 0.232302 0.226174 0.225507 0.227856
chargesum: 0.00000
title: Mulliken charges with hydrogens summed into heavy atoms:
elementType: O O O O O N N C C C C C C C C C C C C C C
charge: -0.085272 -0.077846 -0.077132 -0.147962 -0.095620 -0.039125 -0.019165 0.036236 0.080746 0.134467 0.205903 0.170399 0.077504 -0.068430 -0.208199 0.433771 -0.103889 -0.210731 0.003613 0.004610 -0.013879
polarizability: 2.34147270e+02 -8.25581932e+00 1.76271753e+02 5.00667576e+00 -5.48643641e+00 1.20448504e+02
1716.lowfreq: -10.8223 -6.4855 -0.0009 -0.0004 0.0008 2.3113 16.9560 18.1891 25.4039
frequency: 16.3444 17.4692 24.7492 37.5264 57.2281 77.5777 79.4879 82.5540 103.0669 117.6711 125.5162 158.5610 195.6240 205.1868 232.5558 250.1116 257.8007 274.8363 313.7718 320.4837 339.6747 357.1337 363.5903 377.7491 405.8491 409.4026 456.0295 461.7857 474.3543 515.6670 528.7023 557.0034 585.7414 601.4581 616.4283 618.7399 654.3224 704.6594 715.5984 726.5588 750.5606 796.1983 801.3197 818.9956 845.4259 858.8442 864.4875 915.8446 932.1792 952.0698 961.0795 969.3895 981.5835 989.9666 997.9764 1002.5362 1025.3669 1025.9109 1038.4457 1048.6378 1062.0542 1077.9891 1080.8864 1093.6220 1140.0254 1143.3234 1170.9184 1180.6521 1182.5147 1206.5278 1213.3338 1216.7040 1222.1982 1251.2400 1274.1943 1279.6333 1290.6361 1302.6904 1320.3913 1323.3088 1334.0782 1343.6089 1350.6837 1360.7590 1374.7862 1376.3804 1388.6555 1389.9804 1423.3806 1441.5241 1455.2340 1461.9504 1476.1530 1485.9771 1595.2767 1614.8972 2181.8701 2889.5829 2962.8124 2981.6342 2982.3828 3004.3545 3026.8453 3039.4166 3068.0174 3089.5752 3114.1758 3125.4024 3138.5501 3151.7051 3163.9155 3284.2678 3446.1178 3459.6104 3469.8759 3494.6077 3570.7788
redmass: 5.8070 5.7830 4.1226 5.2011 5.3355 4.6477 6.5290 5.2133 4.0596 5.3482 5.3412 5.6514 5.2080 3.4839 6.3597 4.5708 4.1900 4.8144 4.3872 1.2025 4.3036 4.3761 4.9199 5.3601 2.6682 1.2364 4.2454 3.6144 3.1768 1.2152 2.6822 5.2751 1.9032 1.7557 6.2130 4.4707 1.5982 2.1821 2.1499 2.7672 1.7513 4.0313 1.4282 3.4393 3.6812 1.2491 3.2153 1.3668 5.5779 2.6417 2.3790 2.7139 1.3862 6.1087 1.3463 3.4920 2.5862 2.2172 2.7427 2.5932 2.9899 2.6606 1.6731 2.8168 3.3359 1.2757 1.0573 1.1665 1.1102 1.3591 2.2952 1.2325 1.3005 1.2452 1.2096 1.2284 1.2640 1.3654 1.2995 1.2953 1.2456 1.3289 1.2978 1.6434 1.2759 1.2164 1.4108 3.1014 1.5446 2.1247 1.0837 1.2155 1.3462 1.6334 6.1476 6.1021 12.5873 1.0690 1.0829 1.0889 1.0854 1.0620 1.0827 1.0854 1.0861 1.1042 1.0871 1.0866 1.0919 1.0954 1.1011 1.0648 1.0643 1.0749 1.0650 1.0657 1.0666
irintensity: 0.9207 0.6808 0.1197 1.7727 0.9641 4.8174 0.8474 7.4274 9.7378 7.1293 0.8508 0.5716 14.6412 2.2161 1.6895 15.4645 2.5945 6.6625 33.0141 92.4535 2.0395 11.5939 5.9416 0.7259 9.4443 126.8126 37.9741 34.0633 9.5900 144.0742 10.4782 8.3518 91.3733 81.2093 1.4940 2.9834 104.9833 38.0082 38.0093 101.4696 50.5356 20.8273 186.9832 11.5862 10.9003 0.3385 15.9394 8.7366 113.5198 44.0970 5.7500 14.5002 0.1171 0.2175 0.6567 47.8458 65.4768 24.0742 11.6145 9.4760 14.7033 36.4762 6.4183 30.0991 82.7198 58.9575 0.3583 20.4213 1.3488 39.4285 1.8728 22.5928 23.4736 39.1547 7.7392 5.8184 6.6006 47.5094 30.2926 24.6115 11.9761 9.2827 19.1883 10.3202 6.0605 31.5972 25.7615 10.2954 72.5902 12.0054 8.4594 22.2500 31.8890 1.9667 0.5791 6.0069 4.1854 61.7990 30.5495 21.2780 38.6123 25.7735 1.4309 18.1179 9.5993 24.5454 8.5508 0.6304 24.7559 28.2911 22.6796 278.9226 26.4768 4.5598 61.0898 6.2228 14.4086
temp: 298.150 k
press: 1.00000 atm
elementType: 8 8 8 8 8 7 7 6 6 6 6 6 6 6 6 6 6 6 6 6 6 1 1 1 1 1 1 1 1 1 1 1 1 1 1 1 1 1 1 1 1
symmnumber: 1
zpe: 864583.4 jmol-1
zpe.correction: 0.329302 hartree
zpe.thermalcorrener: 0.351361 hartree
zpe.thermalcorrenthalpy: 0.352305 hartree
zpe.thermalcorrgfe: 0.275013 hartree
zpe.sumelectzpe: -1029.434540 hartree
zpe.sumelectthermal: -1029.412482 hartree
zpe.sumelectthermalent: -1029.411537 hartree
zpe.sumelectthermalfe: -1029.488829 hartree
dipole: -3.6348 -2.6883 0.9773
dipole: 4.6254
quadrupole: -88.4118 -141.4952 -126.9025
quadrupole: 4.6853 -5.3862 2.1229
quadrupole: 30.5247 -22.5587 -7.9660 4.6853 -5.3862 2.1229
hfenergy: -1029.7638424 hartree
pointgroup: C01 [X(C14H20N2O5)]
dipole: -1.4584208 1.0478258 0.2942353 debye
polarizability: 233.1516626|12.9906213|166.2132894|-4.6689191|22.2550803|131.5025761 unknown
InChI: InChI=1S/C14H20N2O5/c15-6-10(16-7-9-4-2-1-3-5-9)12(19)14(21)13(20)11(18)8-17/h1-5,10-14,16-21H,7-8H2
charge 0 multiplicity 1
41 atoms
O  -2.089915 -0.714023 1.595527
O  -1.035136 0.612256 -1.732364
O  -2.751417 1.938207 1.38872
O  -4.708357 -0.52374 1.571807
O  -6.771323 -0.438555 -0.189995
N  1.527351 -0.491709 -0.453664
N  -0.579598 -2.962393 -1.696988
C  -2.30482 -0.184068 0.236627
C  -0.925122 0.213142 -0.321629
C  -3.252969 1.041358 0.342623
C  0.1539 -0.910188 -0.137547
C  -4.712904 0.621748 0.629531
C  -5.502656 0.191887 -0.622433
C  2.243227 0.245046 0.611396
C  -0.230856 -2.071779 -0.982873
C  3.726918 0.393891 0.28769
C  4.452101 -0.681693 -0.285325
C  4.407057 1.600065 0.586162
C  5.834308 -0.554209 -0.545059
C  5.791993 1.728164 0.330718
C  6.510242 0.65009 -0.235286
H  -2.756402 -0.963238 -0.415297
H  -0.568251 1.121321 0.193741
H  -3.21449 1.627372 -0.594136
H  0.104627 -1.230611 0.920647
H  -5.215406 1.48171 1.119663
H  1.593557 -0.037567 -1.374055
H  -4.976185 -0.604759 -1.173592
H  -5.680954 1.050777 -1.297777
H  1.817661 1.255337 0.820743
H  2.125957 -0.34257 1.545383
H  -3.010535 -0.979156 1.908271
H  -1.259786 -0.190836 -2.275526
H  -2.428496 1.340146 2.120178
H  -5.592253 -0.973481 1.476424
H  -7.442502 0.262034 0.009317
H  3.915348 -1.604209 -0.531467
H  3.852628 2.442988 1.018081
H  6.384931 -1.392061 -0.987967
H  6.305946 2.667061 0.566052
H  7.582783 0.748442 -0.437624
