program: Gaussian 09
title: 000230390
version: EM64L-G09RevD.01
frameworkgroup: C1[X(C13H18N2O4)]
method: RPBEPBE
basis: SDD
operation: Freq
keyword: #p
keyword: freq=noraman
keyword: PBEPBE/SDD
title: #p freq=noraman PBEPBE/SDD
converged: YES YES NO NO
title: Mulliken charges:
elementType: O O O O N N C C C C C C C C C C C C C H H H H H H H H H H H H H H H H H H
charge: -0.453553 -0.475753 -0.457294 -0.430599 -0.398670 -0.005382 -0.105326 -0.072265 -0.142403 -0.228920 -0.335723 -0.497501 0.446751 -0.161119 -0.447931 -0.359874 -0.218275 -0.223114 -0.236806 0.212337 0.223771 0.299202 0.257371 0.281323 0.173525 0.286796 0.211881 0.254777 0.371553 0.369534 0.344870 0.235038 0.244748 0.345498 0.229503 0.229963 0.232065
chargesum: 0.00000
title: Mulliken charges with hydrogens summed into heavy atoms:
elementType: O O O O N N C C C C C C C C C C C C C
charge: -0.081999 -0.106220 -0.112424 -0.085101 -0.117347 -0.005382 0.107011 0.151506 0.156799 0.028452 0.124598 -0.030842 0.446751 -0.161119 -0.212893 -0.115126 0.011228 0.006849 -0.004741
polarizability: 2.08901130e+02 1.35101190e+01 1.51454066e+02 -1.42743033e+01 9.13396002e+00 1.29327147e+02
1716.lowfreq: -14.8667 -4.8909 -0.0007 -0.0004 0.0005 3.0905 18.9654 24.4769 34.8706
frequency: 18.6289 24.4484 34.8452 36.7401 49.7218 82.0939 95.9980 110.4204 125.8904 141.6334 163.4897 187.4012 219.4337 238.2753 277.2257 290.7747 318.4148 333.5744 345.7367 370.8208 380.4680 403.9652 415.3445 468.9085 484.6090 486.9462 526.4058 545.2205 567.7625 596.1945 607.7628 616.9232 671.3497 701.9459 709.3753 756.6498 781.1383 814.9333 826.4768 832.3309 856.5491 918.1092 938.4392 954.5271 965.1057 978.9211 986.9005 990.9616 998.6071 1006.9253 1025.7282 1034.3382 1047.7569 1064.3123 1078.1367 1086.2694 1106.6105 1115.7414 1146.4962 1173.3858 1185.0954 1188.7068 1203.2751 1218.2352 1232.6259 1245.8438 1255.5443 1265.7808 1292.3661 1315.7804 1318.3226 1327.3885 1335.5373 1344.8385 1353.2818 1367.9018 1383.5362 1386.8278 1430.9461 1441.2311 1455.4357 1472.1656 1481.0312 1488.5986 1595.3124 1615.0297 2198.8559 2921.2710 2923.2867 2925.5797 2951.9130 2966.5666 3023.9757 3062.2544 3117.4295 3119.2664 3127.2396 3138.8524 3150.0659 3165.8751 3322.6727 3410.8410 3477.3485 3506.6139 3529.3372
redmass: 4.6314 4.2553 5.7194 6.4704 4.4364 4.4987 6.6803 7.0142 5.3291 6.1841 4.3094 5.1444 4.2262 4.0400 3.3339 5.1576 4.9751 4.2957 2.9267 3.9488 1.4334 2.8082 3.8391 1.1379 3.1067 4.7062 3.4137 3.4611 1.9430 1.7236 1.5355 5.5488 2.4102 2.7321 2.4630 1.8066 1.5852 3.3133 3.3890 3.4476 1.2501 1.4414 3.0545 5.6648 1.9753 1.3894 2.0179 5.9781 1.3337 3.3162 2.2071 3.5668 3.7901 2.5857 2.4984 1.5975 3.8569 2.7699 1.2126 1.0555 1.1356 1.1482 1.1701 2.3364 1.3009 1.3186 1.1739 1.1707 1.1681 1.3389 1.2893 1.2504 1.3135 1.3944 1.4369 1.1689 1.2703 5.9048 1.7357 2.1316 1.2864 1.0872 1.6590 1.3448 6.0983 6.1115 12.5645 1.0723 1.0687 1.0815 1.0846 1.0822 1.0918 1.0857 1.0911 1.0871 1.0863 1.0915 1.0963 1.1016 1.0639 1.0742 1.0648 1.0655 1.0655
irintensity: 0.1857 0.2491 0.2713 2.5401 8.7184 4.9900 1.1073 0.5656 11.9623 2.6852 4.0900 2.3846 9.5529 0.2892 11.2936 23.2584 2.6434 0.3555 8.2463 1.4099 3.7871 0.2966 4.8660 199.5020 20.2375 1.8790 9.0430 23.2688 46.0704 23.6156 155.2537 7.9953 33.3231 27.6200 37.8728 87.0697 70.9455 56.1672 31.6279 30.7580 1.4021 6.2329 7.1130 131.5680 10.2815 0.0692 24.3623 0.6254 0.2855 82.7845 7.4677 12.3526 13.2051 1.1308 14.0127 10.7316 62.0138 1.7885 106.5159 0.0281 23.3639 19.7173 8.4321 7.0548 28.7008 35.4301 39.5614 17.9529 2.6868 1.0380 81.0022 10.7594 5.8603 51.7167 6.4722 33.0659 11.1332 1.2450 2.4341 8.5044 32.9279 7.0988 23.0231 0.6105 0.8857 2.1762 2.7124 53.7716 58.1867 16.9263 65.5593 16.5739 10.0736 18.6165 1.6463 7.1508 0.7046 15.5635 38.7749 19.3101 172.9213 2.9767 45.2243 5.8859 7.2992
temp: 298.150 k
press: 1.00000 atm
elementType: 8 8 8 8 7 7 6 6 6 6 6 6 6 6 6 6 6 6 6 1 1 1 1 1 1 1 1 1 1 1 1 1 1 1 1 1 1
symmnumber: 1
zpe: 779809.6 jmol-1
zpe.correction: 0.297014 hartree
zpe.thermalcorrener: 0.316762 hartree
zpe.thermalcorrenthalpy: 0.317706 hartree
zpe.thermalcorrgfe: 0.245940 hartree
zpe.sumelectzpe: -915.068580 hartree
zpe.sumelectthermal: -915.048832 hartree
zpe.sumelectthermalent: -915.047887 hartree
zpe.sumelectthermalfe: -915.119654 hartree
dipole: 2.1706 -0.6155 -2.4242
dipole: 3.3116
quadrupole: -97.9664 -126.0605 -118.2512
quadrupole: 12.4254 -8.1959 7.6704
quadrupole: 16.1263 -11.9678 -4.1585 12.4254 -8.1959 7.6704
hfenergy: -915.3655937 hartree
pointgroup: C01 [X(C13H18N2O4)]
dipole: 0.890869 -0.7765231 0.5485461 debye
polarizability: 209.6199144|-15.499111|124.991531|-8.6937786|0.6930561|155.0708982 unknown
InChI: InChI=1S/C13H18N2O4/c14-6-10(12(18)13(19)11(17)8-16)15-7-9-4-2-1-3-5-9/h1-5,10-13,15-19H,7-8H2
charge 0 multiplicity 1
37 atoms
O  -1.363316 0.016741 -1.04852
O  -3.031209 -0.548802 2.185669
O  -5.374503 -0.673593 0.791405
O  -5.386953 -1.162357 -2.082936
N  0.84144 -0.164123 0.541658
N  -0.805276 2.741745 1.583505
C  -1.566523 -0.47715 0.304116
C  -2.981207 -0.119578 0.780142
C  -0.453074 0.115985 1.23513
C  -4.109156 -0.829691 -0.001132
C  -4.348849 -0.353617 -1.438835
C  2.059407 0.494905 1.102907
C  3.294676 0.101646 0.306063
C  -0.629996 1.574559 1.415812
C  4.40038 -0.511153 0.944852
C  3.361064 0.35594 -1.088577
C  5.555452 -0.86224 0.207557
C  4.51095 0.003788 -1.827447
C  5.612906 -0.606165 -1.18096
H  -1.449745 -1.585089 0.348678
H  -3.118959 0.982442 0.704475
H  -0.551193 -0.353433 2.23741
H  -3.951202 -1.9226 0.011559
H  0.984429 -1.18449 0.476143
H  -4.624218 0.726958 -1.434936
H  -3.436139 -0.471821 -2.039679
H  2.211165 0.243825 2.177041
H  1.89485 1.587313 1.046432
H  -0.366349 0.114982 -1.132486
H  -3.994065 -0.684669 2.402714
H  -5.663382 0.277107 0.735508
H  4.360472 -0.711196 2.022963
H  2.50819 0.830375 -1.587334
H  -6.13934 -1.257019 -1.44158
H  6.404587 -1.333668 0.714719
H  4.552195 0.207897 -2.903219
H  6.506386 -0.877255 -1.754313
