program: Gaussian 09
title: 000230388
version: EM64L-G09RevD.01
frameworkgroup: C1[X(C6H13NO5)]
method: RPBEPBE
basis: SDD
operation: Freq
keyword: #p
keyword: freq=noraman
keyword: PBEPBE/SDD
title: #p freq=noraman PBEPBE/SDD
converged: YES YES NO NO
title: Mulliken charges:
elementType: O O O O O N C C C C C C H H H H H H H H H H H H H
charge: -0.293888 -0.467674 -0.461347 -0.463498 -0.439104 -0.591701 -0.161330 -0.081892 -0.107298 -0.048422 -0.132995 -0.363731 0.227775 0.218935 0.223587 0.231509 0.225860 0.187298 0.249928 0.295342 0.308315 0.369471 0.365594 0.361517 0.347751
chargesum: 0.00000
title: Mulliken charges with hydrogens summed into heavy atoms:
elementType: O O O O O N C C C C C C
charge: -0.293888 -0.098203 -0.095753 -0.101982 -0.091354 0.011956 0.066445 0.137044 0.116289 0.183087 0.092866 0.073494
polarizability: 9.94169719e+01 4.21138223e+00 9.84623604e+01 -4.28239099e-01 5.36910054e-01 6.70463773e+01
1716.lowfreq: -22.3146 -12.5348 0.0003 0.0007 0.0012 3.1159 63.5565 93.5787 106.9874
frequency: 63.5513 93.5572 106.9763 136.4076 172.4538 210.2981 220.8687 259.8647 278.1410 312.6653 346.8835 376.8045 396.4578 409.1436 421.1874 440.4301 449.2524 474.0421 489.7003 531.3083 562.5497 581.4028 600.8576 696.1512 843.8589 901.7973 944.1800 960.5038 977.1533 985.4492 1020.2053 1043.7541 1048.4958 1050.7768 1073.6101 1105.9160 1154.7245 1171.5329 1197.1394 1200.8559 1221.0998 1234.6122 1254.6893 1279.7537 1290.5623 1300.6952 1315.9139 1320.3868 1340.0953 1373.1008 1380.0916 1392.4946 1395.1475 1408.5621 1463.8123 1651.8594 2952.1465 2955.7058 2956.8257 2967.5954 2980.6585 2990.2223 3107.8064 3472.6971 3505.7930 3531.6004 3546.6749 3566.6612 3599.6119
redmass: 6.0923 4.7986 5.4887 5.0457 2.7422 3.9091 4.0589 3.5758 4.1629 4.4682 1.6561 2.0825 3.5968 2.2176 1.1802 1.7421 1.9273 1.4803 1.2753 2.2503 4.4401 2.5987 3.9277 1.6439 2.6322 5.7436 4.3838 4.7943 4.3991 2.7640 2.7045 2.5747 3.2925 3.0295 2.4348 2.1931 1.5033 1.5349 1.3259 1.6288 1.1506 1.3284 1.2080 1.2340 1.2816 1.2414 1.2582 1.2648 1.2259 1.6798 1.3543 1.6049 1.4321 1.7001 1.0819 1.0998 1.0809 1.0732 1.0814 1.0825 1.0846 1.0864 1.0939 1.0458 1.0650 1.0651 1.0656 1.0658 1.0978
irintensity: 1.5717 5.1852 1.8624 3.6498 1.7337 2.3127 19.9387 14.1924 2.3996 24.7235 17.1577 5.6882 7.3399 24.0793 61.3652 104.6916 198.7172 67.8338 194.6443 68.7464 25.3832 12.7819 34.4543 252.1944 51.2641 136.9125 163.5423 120.8322 6.6863 20.0874 20.1408 20.5889 20.1065 143.5959 62.1495 15.2214 9.9440 12.5775 5.5211 39.4600 18.1594 27.9641 0.4070 24.7071 9.4553 64.1899 8.6097 7.6737 11.6980 3.3552 27.6651 11.8288 2.8705 28.0697 5.2917 60.0922 4.2151 31.9679 1.9366 1.1217 31.1922 181.2805 12.3464 8.7282 20.4846 7.8138 17.9108 21.3360 9.9293
temp: 298.150 k
press: 1.00000 atm
elementType: 8 8 8 8 8 7 6 6 6 6 6 6 1 1 1 1 1 1 1 1 1 1 1 1 1
symmnumber: 1
zpe: 532743.7 jmol-1
zpe.correction: 0.202911 hartree
zpe.thermalcorrener: 0.215825 hartree
zpe.thermalcorrenthalpy: 0.216769 hartree
zpe.thermalcorrgfe: 0.164641 hartree
zpe.sumelectzpe: -666.286932 hartree
zpe.sumelectthermal: -666.274018 hartree
zpe.sumelectthermalent: -666.273074 hartree
zpe.sumelectthermalfe: -666.325203 hartree
dipole: -3.4448 -2.8768 0.7620
dipole: 4.5523
quadrupole: -87.4363 -62.9711 -70.2883
quadrupole: 2.9198 1.9387 -0.8035
quadrupole: -13.8711 10.5941 3.2770 2.9198 1.9387 -0.8035
hfenergy: -666.4898434 hartree
pointgroup: C01 [X(C6H13N1O5)]
dipole: 1.4120057 1.0366912 0.3730803 debye
dipolederiv: -1.1512232 -0.4103745 -0.0600978 -0.235288 -0.7436425 -0.0312747 0.0426311 0.0464444 -0.3756818 -0.5244756 0.2948376 -0.1316375 0.2796308 -0.7614129 -0.0655304 -0.1585869 -0.0355794 -0.4842204 -0.4052556 -0.2314553 0.0944498 -0.2674156 -0.7638709 -0.1111551 0.090426 -0.1393224 -0.4999274 -0.9178459 -0.0900191 0.0278229 0.0007398 -0.3621317 0.0983645 0.0494465 0.1228089 -0.4980806 -0.5797998 0.2557632 0.1227261 0.3305796 -0.5988493 0.1022701 0.1475139 0.0844976 -0.4999137 -0.8966538 -0.2632317 0.0453412 -0.2675218 -0.7485597 -0.1114857 0.0023309 -0.1308869 -0.2354427 0.3147798 -0.2884899 0.0911272 -0.2602581 0.4183465 -0.0406573 0.0808099 -0.0208646 0.3202753 0.174047 0.2235406 -0.0119384 0.0979515 0.5354944 0.1157888 -0.040313 0.0849038 0.3641248 0.4721855 0.0740156 -0.1099545 0.1614802 0.0173446 -0.0720642 -0.0503796 -0.0120075 0.3456559 0.2703107 0.1814615 0.0721692 0.1858051 0.4189923 0.0436942 0.2208613 0.0966215 0.3112538 1.0524496 0.4026065 0.0208435 0.3978844 0.8507247 0.0829311 -0.0947206 -0.0185556 0.3734113 0.3424324 -0.2020202 0.0016124 -0.1815626 0.4378026 -0.1145422 -0.0489054 -0.0768777 0.3799159 0.0219256 0.0269932 -0.0135693 0.0324816 -0.0132737 0.0413756 -0.0265366 0.0432034 -0.1681018 0.0234988 -0.0236302 -0.0145709 -0.0166048 0.0000671 -0.0131907 -0.0104599 -0.0255802 -0.1858209 -0.006401 -0.0070913 0.0305263 -0.0124928 0.0317622 -0.0052596 0.0382854 -0.0066138 -0.1880446 0.0293487 -0.0106857 0.0487768 -0.0544925 -0.0073603 0.0351912 -0.0248884 -0.0145313 -0.1681743 -0.0185055 -0.0402167 -0.0269741 0.0017999 0.0250183 -0.0190185 0.0295818 0.0304216 -0.1618762 0.0254058 0.0605538 -0.056082 0.053717 0.0082705 0.0408227 0.000915 0.0903831 -0.2018053 0.0335099 -0.0855304 -0.032225 -0.0438931 -0.0202193 -0.0236765 -0.0487254 -0.0596224 0.0681624 0.3669891 0.0462001 0.0710399 -0.0151626 0.1822869 0.0442607 0.0022528 0.0002736 0.0662392 0.2827107 0.1648035 -0.0816199 0.0586539 0.1133285 0.0077034 -0.0814457 -0.0399036 0.1844668 0.1434785 -0.0585783 0.0660407 -0.0974367 0.355395 0.067342 0.0745477 0.0668641 0.3224633 0.2353563 0.1623782 -0.0664148 0.1220243 0.2674801 0.0128875 -0.0834428 0.0222412 0.3212135 0.3959281 -0.0348621 0.0151583 -0.1155613 0.1572174 -0.0546941 0.0080068 -0.0760982 0.3126992 0.3158038 -0.1469684 -0.1025503 -0.1550581 0.1997892 -0.0300826 -0.1192048 -0.0322196 0.2972085 unknown
polarizability: 99.8439737|4.1064151|97.9511915|0.5955974|1.7324075|67.1305444 unknown
InChI: InChI=1S/C6H13NO5/c7-6-5(11)4(10)3(9)2(1-8)12-6/h2-6,8-11H,1,7H2
charge 0 multiplicity 1
25 atoms
O  -0.624291 1.203418 0.300626
O  1.803281 -2.237067 0.154406
O  -0.983809 -2.428593 -0.50967
O  2.996317 0.367468 -0.331863
O  -3.3892 1.149141 -0.124904
N  1.308177 2.661773 0.325332
C  1.064379 -1.064153 -0.328081
C  -0.389045 -1.254024 0.129148
C  1.644291 0.242533 0.218067
C  -1.231147 -0.029833 -0.276355
C  0.76659 1.442564 -0.207093
C  -2.66456 -0.063263 0.260677
H  1.099152 -1.026174 -1.439473
H  -0.394153 -1.366023 1.235592
H  1.671653 0.202757 1.330004
H  -1.249897 0.056313 -1.384346
H  0.736692 1.509147 -1.315357
H  -2.639863 -0.180884 1.365539
H  -3.209367 -0.910422 -0.182182
H  1.313218 2.709881 1.349372
H  0.97653 3.524736 -0.111753
H  2.758998 -2.112556 -0.076991
H  -0.350319 -3.181492 -0.379938
H  3.282121 1.307641 -0.177731
H  -2.807546 1.915015 0.123179
