program: Gaussian 09
title: 000230381
version: EM64L-G09RevD.01
frameworkgroup: C1[X(C6H6N4O2)]
method: RPBEPBE
basis: SDD
operation: Freq
keyword: #pfreq=noraman
keyword: PBEPBE/SDD
title: #p freq=noraman PBEPBE/SDD
converged: NO NO NO NO
title: Mulliken charges:
elementType: O O N N N N C C C C C C H H H H H H
charge: -0.226168 -0.233403 -0.385220 -0.446683 -0.408545 -0.003259 0.307693 0.106611 0.166276 0.126171 -0.011943 -0.769376 0.326116 0.337455 0.356749 0.233975 0.233905 0.289647
chargesum: 0.00000
title: Mulliken charges with hydrogens summed into heavy atoms:
elementType: O O N N N N C C C C C C
charge: -0.226168 -0.233403 -0.059105 -0.109228 -0.051797 -0.003259 0.307693 0.106611 0.166276 0.126171 -0.011943 -0.011849
polarizability: 1.41070229e+02 -1.95428137e+00 1.13952203e+02 -9.34853931e-04 -1.61961526e-06 4.45834718e+01
1716.lowfreq: -8.4432 -0.0008 -0.0007 -0.0006 5.9641 8.2251 71.1775 94.8861 130.6850
frequency: 71.1092 94.8859 130.6817 205.6285 217.7544 254.7989 293.2849 340.1602 425.8294 440.1488 501.8374 518.9185 548.8923 587.0221 596.8750 612.3041 626.1084 640.2865 704.7682 720.8289 757.2968 828.1699 920.4854 943.3841 959.9473 1044.7339 1063.1616 1124.4318 1207.5113 1251.9428 1259.2498 1275.3596 1363.6565 1392.3641 1410.1433 1454.4612 1470.8612 1544.1559 1569.3346 1607.8314 1646.1902 1710.1636 2983.6866 3062.2996 3142.7449 3554.6320 3612.3050 3613.9223
redmass: 1.0987 4.2124 8.4109 4.8590 7.0376 6.1831 3.6328 6.7196 7.0820 7.7439 1.2091 5.9692 1.2557 7.1264 2.5464 1.6050 5.9191 3.0181 12.3127 6.2825 10.4815 5.8632 4.9378 4.0058 2.2914 1.5249 3.5346 6.7541 2.5496 2.3643 2.4601 1.8692 1.9408 1.2294 5.1552 1.0920 1.0448 7.6335 4.2004 8.7374 8.7657 8.3256 1.0397 1.0982 1.0965 1.0792 1.0810 1.0820
irintensity: 0.0107 1.9375 0.8459 4.7296 4.7132 1.5715 2.5591 0.8670 3.0788 7.1921 20.0070 0.7971 137.5041 5.3280 7.1681 95.8344 1.6460 127.9009 20.0447 9.1101 4.5265 11.8950 34.3003 27.9887 22.1094 4.4505 14.2982 3.4846 26.1701 56.3348 29.8697 13.7676 29.9142 23.9514 60.9887 19.7957 20.7721 119.0231 197.3667 168.1878 361.4404 775.3883 17.2710 15.7609 1.6241 51.3906 121.2392 59.4931
temp: 298.150 k
press: 1.00000 atm
elementType: 8 8 7 7 7 7 6 6 6 6 6 6 1 1 1 1 1 1
symmnumber: 1
zpe: 336788.0 jmol-1
zpe.correction: 0.128276 hartree
zpe.thermalcorrener: 0.138341 hartree
zpe.thermalcorrenthalpy: 0.139285 hartree
zpe.thermalcorrgfe: 0.092552 hartree
zpe.sumelectzpe: -600.862022 hartree
zpe.sumelectthermal: -600.851957 hartree
zpe.sumelectthermalent: -600.851013 hartree
zpe.sumelectthermalfe: -600.897747 hartree
dipole: -2.5222 -7.9896 -0.0001
dipole: 8.3783
quadrupole: -82.0982 -67.2423 -69.2910
quadrupole: 14.9856 0.0000 0.0004
quadrupole: -9.2210 5.6349 3.5862 14.9856 0.0000 0.0004
hfenergy: -600.9902982 hartree
pointgroup: C01 [X(C6H6N4O2)]
dipole: 0.8635171 -3.1811034 0.0176367 debye
dipolederiv: -1.7354414 -0.1788222 0.002822 -0.1413329 -0.4309618 0.0004841 0.0025404 0.0005248 -0.3801712 -0.4393376 0.0728948 -0.000349 -0.1984245 -1.3376752 0.0059108 0.0012496 0.0055612 -0.3770115 -0.8971432 0.1422223 0.0000682 -0.1464166 -0.7058796 0.0031153 0.0017827 0.0026415 -0.2063766 -1.1092599 -0.1788378 0.0020598 0.2855718 -0.4866034 0.0005409 -0.0006778 0.0011256 -0.3346867 -1.0285784 0.0371734 0.0007154 -0.4613278 -0.4937131 0.0016695 0.0036468 0.0010241 -0.3110069 -0.5557526 0.3990466 -0.0019629 0.1547382 -0.9704873 0.0039627 -0.0005093 0.0036628 -0.2604619 0.9023348 0.0656827 -0.0014245 0.4227568 0.7555041 -0.0043832 -0.0034952 -0.0038849 0.1030873 0.2986638 -0.5682468 0.0029518 -0.5706583 -0.6299023 0.0043899 0.002986 0.0043973 -0.0102204 0.8485951 0.0772177 -0.0015224 0.1837092 0.9786209 -0.005694 -0.0023179 -0.0054913 0.0476644 2.3998887 0.1670621 -0.0037521 0.1340421 0.7918783 -0.0032435 -0.0035166 -0.0032748 0.2722014 0.8137894 -0.0249923 -0.0006128 0.1688976 1.8431478 -0.0096384 -0.0017486 -0.0094001 0.240676 -0.1969682 0.0721534 -0.0001146 0.170736 -0.0892453 0.0005946 -0.0004699 0.000616 0.0627157 0.1845584 -0.0318913 0.0003859 -0.0221948 0.1836868 0.0009567 0.0003247 0.0010326 0.3389586 0.1758536 0.0262042 0.0001034 0.0514584 0.241152 0.0007259 -0.0000446 0.0007508 0.3763083 0.2077791 -0.0749309 0.0006491 -0.039002 0.2699227 0.0006308 0.0004358 0.0006772 0.3680721 0.0427743 0.0152186 -0.0263707 0.0615683 0.0179345 -0.1070934 0.0310994 -0.1170187 -0.0312474 0.0427822 0.0156924 0.0261 0.0614294 0.0203147 0.1064589 -0.0319699 0.1165003 -0.0336832 0.0454618 -0.0328468 0.0002534 -0.1155508 0.0423062 0.0006126 0.0006845 0.0005557 0.1351822 unknown
polarizability: 141.1841068|0.8439544|113.8357453|-0.1318008|-0.4088296|44.5860518 unknown
InChI: InChI=1S/C6H6N4O2/c1-2-7-4-3(5(11)8-2)9-6(12)10-4/h7,9-10H,1H3
charge 0 multiplicity 1
18 atoms
O  -3.767551 -0.399264 0.00627
O  0.766135 2.709132 -0.017884
N  0.970507 -1.434819 0.00626
N  -1.547717 -1.339605 0.008959
N  -1.727977 0.89111 -0.003957
N  2.062764 0.715749 -0.007886
C  -0.262758 -0.810135 0.004194
C  -0.35571 0.579316 -0.003881
C  2.119498 -0.601901 -0.000149
C  -2.519373 -0.269968 0.003926
C  0.812024 1.44364 -0.01051
C  3.445735 -1.328107 0.002336
H  1.072467 -2.450541 0.012227
H  -1.84006 -2.31486 0.015039
H  -2.10559 1.83711 -0.009067
H  3.558054 -1.972417 -0.890103
H  3.559957 -1.962856 0.90136
H  4.247993 -0.577981 -0.002534
