program: Gaussian 09
title: 000230339
version: EM64L-G09RevD.01
frameworkgroup: C1[X(C16H26N2O2)]
method: RPBEPBE
basis: SDD
operation: Freq
keyword: #p
keyword: freq=noraman
keyword: PBEPBE/SDD
title: #p freq=noraman PBEPBE/SDD
converged: YES YES NO NO
title: Mulliken charges:
elementType: O O N N C C C C C C C C C C C C C C C C H H H H H H H H H H H H H H H H H H H H H H H H H H
charge: -0.260512 -0.288831 -0.088900 -0.380732 -0.340471 -0.317261 -0.382386 -0.390927 -0.696346 -0.685020 0.150566 0.277922 -0.354273 -0.341399 0.353319 -0.366586 -0.377982 -0.257554 -0.394337 -0.677626 0.225951 0.194856 0.227903 0.186322 0.209160 0.218090 0.225562 0.247875 0.213007 0.210382 0.226828 0.213274 0.222063 0.222176 0.297159 0.205904 0.276810 0.246651 0.253739 0.202918 0.202766 0.220591 0.220121 0.229297 0.209707 0.210225
chargesum: 0.00000
title: Mulliken charges with hydrogens summed into heavy atoms:
elementType: O O N N C C C C C C C C C C C C C C C C
charge: -0.260512 -0.288831 -0.088900 -0.083572 0.080336 0.096965 0.044863 0.082510 -0.046130 -0.027507 0.150566 0.277922 -0.148369 -0.064589 0.353319 -0.119935 -0.124243 0.148130 0.046374 -0.028397
polarizability: 3.07624875e+02 9.33718342e+00 1.81597503e+02 -7.97813810e+00 1.59333192e+01 1.36118084e+02
1716.lowfreq: -26.8184 -7.1218 -2.2556 -0.0015 -0.0010 0.0008 7.2324 12.8569 18.7922
frequency: -16.2832 8.7574 17.9184 39.5238 43.1119 47.8742 70.1930 79.6759 83.0572 97.5706 112.1773 144.9298 153.7503 174.2001 202.6235 214.5832 222.0901 261.8995 270.1085 275.7860 278.8628 289.5440 318.8847 348.1759 398.5082 407.8411 414.7248 454.8462 478.6062 486.0930 504.0319 518.3097 545.9501 626.6206 631.2947 683.8972 735.3687 746.8812 756.3331 768.1539 768.6783 795.5506 799.7258 809.6161 837.7183 856.7779 895.1439 895.8178 902.0580 932.7997 973.2326 977.5427 990.1009 992.2120 1009.8290 1025.9854 1053.1593 1053.5632 1066.8616 1073.1389 1086.3540 1113.3202 1116.7117 1136.0452 1142.2852 1144.0571 1176.5742 1183.2584 1203.6667 1230.5502 1231.3214 1246.4890 1270.7440 1280.7858 1286.3553 1299.0713 1304.2458 1310.4008 1322.9381 1336.9211 1340.7594 1368.1957 1370.6190 1375.4130 1379.8360 1382.2479 1387.5024 1396.1821 1422.1918 1441.5521 1456.4704 1465.2694 1469.3603 1472.0721 1475.6501 1476.9433 1480.3040 1480.4716 1480.9952 1487.3073 1490.9646 1495.7081 1507.9538 1560.3421 1598.4689 1619.3488 2870.6360 2909.2789 2946.8119 2976.2104 2979.6371 2981.9048 2986.3252 3005.4519 3006.1297 3017.9621 3023.8831 3030.1619 3035.6883 3054.0569 3071.5834 3075.4935 3079.0863 3082.3203 3085.4773 3088.3529 3092.0847 3117.1927 3153.1250 3164.7421 3173.0762 3570.0004
redmass: 3.1286 4.0262 3.9451 3.6989 4.6957 2.7042 3.5105 2.4075 2.1216 2.8852 3.4526 2.1303 2.4628 2.2860 2.0965 1.5080 1.1614 3.2051 2.2935 2.3271 2.5203 3.0131 3.6773 4.5756 2.6087 3.1021 3.1826 4.8395 2.6437 2.7642 1.7698 2.0337 3.2342 6.0817 6.3949 4.0343 1.8263 2.7554 3.6415 1.1336 1.0946 3.1160 1.2617 1.4024 2.7933 1.5824 1.1680 1.9782 1.7362 1.3910 2.4791 6.0853 1.3850 4.2979 2.9148 2.8460 2.7168 2.5785 2.2128 1.8861 2.1929 1.6054 1.3636 2.1701 1.4503 2.4682 1.9416 1.3546 2.1054 1.2616 3.1434 1.5635 2.0487 1.1601 1.1037 1.1705 1.3290 1.3574 1.3131 1.3501 1.2255 3.1989 1.2710 1.2894 1.2506 1.7048 1.2652 1.2340 4.0219 1.1522 1.0687 1.0552 1.3631 1.0625 1.2117 1.0620 1.0517 1.0773 1.1069 1.0802 1.1210 1.0851 2.3836 7.1147 7.0291 6.2756 1.0715 1.0675 1.0550 1.0352 1.0362 1.0409 1.0561 1.1049 1.0614 1.0909 1.0612 1.0876 1.1009 1.1015 1.0990 1.0992 1.1005 1.1030 1.0988 1.1004 1.1051 1.0888 1.0880 1.0934 1.0971 1.0775
irintensity: 0.2892 1.4674 0.0733 0.1922 3.7549 0.7098 0.0931 2.6442 0.1474 0.2969 1.1319 0.1428 9.3888 2.1516 1.4984 0.2873 0.0986 1.1278 3.1249 2.8004 1.1410 1.0784 21.0795 2.5992 1.2340 4.5670 2.4152 1.8653 6.0358 4.1481 55.9220 49.0271 26.9314 10.9663 4.7233 22.1082 5.2125 8.7729 15.8147 5.9106 9.3944 3.0493 11.9924 10.3172 9.0376 46.2183 3.0314 3.0115 6.5754 0.1988 9.5842 117.8652 1.6425 2.5297 12.4269 11.2347 11.4271 1.8494 33.2778 36.1753 29.8264 2.8423 35.2348 6.3142 0.3908 2.0552 38.3313 197.6691 37.0137 0.3577 229.1720 12.6629 203.1200 7.8883 0.0072 14.2766 3.2580 0.8718 6.8551 8.5257 14.2479 0.1170 14.1029 9.1916 16.3056 13.0126 27.2998 25.3852 3.6955 37.9102 9.8434 30.1995 222.3946 14.8128 106.8400 6.8221 4.2468 40.5366 43.4927 9.2224 2.4366 4.6610 37.9943 72.9774 77.5192 176.7153 78.3295 58.0044 33.4503 29.9689 37.9193 24.5627 54.9151 27.8518 23.4464 17.3171 47.4079 13.0514 20.1268 0.0310 48.1572 69.7158 47.8038 81.3195 43.5079 45.0366 15.5590 23.1186 0.8992 14.5283 6.2594 10.5413
temp: 298.150 k
press: 1.00000 atm
elementType: 8 8 7 7 6 6 6 6 6 6 6 6 6 6 6 6 6 6 6 6 1 1 1 1 1 1 1 1 1 1 1 1 1 1 1 1 1 1 1 1 1 1 1 1 1 1
symmnumber: 1
zpe: 1037779.4 jmol-1
zpe.correction: 0.395269 hartree
zpe.thermalcorrener: 0.417334 hartree
zpe.thermalcorrenthalpy: 0.418279 hartree
zpe.thermalcorrgfe: 0.340446 hartree
zpe.sumelectzpe: -883.680464 hartree
zpe.sumelectthermal: -883.658399 hartree
zpe.sumelectthermalent: -883.657455 hartree
zpe.sumelectthermalfe: -883.735287 hartree
dipole: 2.4425 4.6604 1.6158
dipole: 5.5042
quadrupole: -100.6203 -121.6665 -123.7284
quadrupole: 2.8686 2.6706 2.0849
quadrupole: 14.7181 -6.3281 -8.3900 2.8686 2.6706 2.0849
hfenergy: -884.0757334 hartree
pointgroup: C01 [X(C16H26N2O2)]
dipole: 0.939703 1.9405897 0.2013897 debye
polarizability: 307.9420943|8.008226|186.5391958|-4.7652628|3.5532859|130.8591723 unknown
InChI: InChI=1S/C16H26N2O2/c1-4-13-20-15-9-7-14(8-10-15)16(19)17-11-12-18(5-2)6-3/h7-10,17H,4-6,11-13H2,1-3H3
charge 0 multiplicity 1
46 atoms
O  4.982078 -0.498842 0.055525
O  -1.309055 -1.88295 0.192121
N  -5.081174 0.557072 0.134739
N  -1.435644 0.218023 1.172133
C  -3.617802 0.760762 0.042173
C  -5.507721 -0.787317 -0.334435
C  -5.895846 1.693401 -0.360477
C  -2.901945 0.170727 1.28769
C  -6.904304 -1.192364 0.172694
C  -5.857402 1.956194 -1.892314
C  -0.723814 -0.821673 0.588935
C  0.765104 -0.645482 0.468436
C  1.423767 0.60784 0.530282
C  1.549117 -1.811158 0.24782
C  3.590814 -0.471258 0.197315
C  2.825752 0.706612 0.39716
C  2.943098 -1.732027 0.119061
C  5.714581 0.781663 0.116854
C  7.199967 0.460537 -0.062662
C  8.065489 1.739201 -0.022451
H  -3.172004 0.295262 -0.867373
H  -3.409026 1.846632 -0.014557
H  -4.767452 -1.517523 0.040692
H  -5.47719 -0.868451 -1.449694
H  -5.552252 2.60217 0.170988
H  -6.943766 1.531911 -0.045598
H  -3.221731 0.719313 2.19084
H  -3.19108 -0.887299 1.405787
H  -7.124178 -2.237127 -0.114403
H  -7.703137 -0.556858 -0.250967
H  -6.947571 -1.112736 1.273369
H  -6.471359 2.841581 -2.143257
H  -6.255802 1.098221 -2.4637
H  -4.825837 2.148187 -2.241212
H  -0.936133 1.018566 1.557933
H  0.853202 1.53789 0.645637
H  1.028771 -2.771426 0.174905
H  3.302262 1.690111 0.438349
H  3.553863 -2.624759 -0.045144
H  5.353521 1.454822 -0.688983
H  5.52924 1.268812 1.097269
H  7.337232 -0.065642 -1.025452
H  7.512731 -0.239677 0.733925
H  9.133733 1.49094 -0.149501
H  7.956722 2.270326 0.941858
H  7.785785 2.441491 -0.830106
