program: Gaussian 09
title: 000230337
version: EM64L-G09RevD.01
frameworkgroup: C1[X(C13H15N5O)]
method: RPBEPBE
basis: SDD
operation: Freq
keyword: #p
keyword: freq=noraman
keyword: PBEPBE/SDD
title: #p freq=noraman PBEPBE/SDD
converged: NO YES NO NO
title: Mulliken charges:
elementType: O N N N N N C C C C C C C C C C C C C H H H H H H H H H H H H H H H
charge: -0.503741 -0.413035 -0.428270 0.017584 -0.189802 -0.160713 0.044634 -0.473656 0.281409 0.295756 -0.322854 -0.350441 -0.351303 -0.156889 -0.149439 -0.197352 -0.205519 -0.293138 -0.318000 0.364924 0.358064 0.187131 0.227957 0.203480 0.210373 0.242246 0.235999 0.237337 0.238761 0.231738 0.232781 0.246751 0.238907 0.418320
chargesum: 0.00000
title: Mulliken charges with hydrogens summed into heavy atoms:
elementType: O N N N N N C C C C C C C C C C C C C
charge: -0.085421 -0.048111 -0.070206 0.017584 -0.189802 -0.160713 0.044634 -0.058569 0.281409 0.295756 0.091000 -0.108195 -0.115304 0.080448 0.089322 0.034386 0.027262 -0.046387 -0.079093
polarizability: 2.39101588e+02 -1.26950004e+01 2.04838822e+02 -8.04706681e-01 1.04672865e+01 1.28099494e+02
1716.lowfreq: -10.1809 -6.2099 -0.0006 -0.0003 0.0004 6.8288 24.3570 41.7009 61.8312
frequency: 24.1893 41.6740 61.8243 90.4358 93.3594 112.5703 144.1514 162.8782 183.4625 208.7188 220.1634 271.7477 316.2678 347.8220 398.0539 407.4279 417.2078 457.4057 485.4133 512.8385 518.3654 540.6529 583.0387 592.1290 623.8246 628.6028 658.4089 690.4269 736.3977 739.1860 756.1937 771.4872 777.0045 817.0862 861.4418 864.4186 867.4681 878.6176 888.1350 929.4354 949.3866 950.7299 965.5732 976.0968 985.2031 985.6509 997.6170 1020.3468 1038.1528 1059.5527 1066.8139 1094.4845 1098.9779 1111.3957 1164.1183 1166.5404 1189.6526 1207.5061 1224.8796 1269.3601 1273.8391 1307.8412 1313.6645 1316.5067 1340.0771 1346.5664 1353.5365 1392.4101 1403.3269 1450.3108 1458.3058 1463.0615 1468.4834 1474.5312 1481.5589 1492.6617 1560.6061 1562.0205 1598.7487 1602.5697 1646.5367 2761.7423 2932.6340 2978.9770 3049.2345 3064.4219 3134.2315 3135.8644 3139.3764 3141.8867 3157.5372 3162.4912 3180.8326 3181.1900 3297.7159 3457.6452
redmass: 5.0930 4.4353 4.7362 4.6790 4.6397 4.9507 5.1046 5.9986 4.2127 5.1820 2.8486 3.7602 5.2521 5.7729 4.3119 3.3901 3.5665 4.0701 3.5637 2.3176 2.7978 2.3425 3.0613 2.5294 4.9817 6.2529 4.6590 2.8374 2.4374 2.1047 2.2751 2.0807 2.1465 3.1052 2.8510 1.4831 1.3916 3.1781 2.6119 2.8559 1.4147 1.4127 6.7553 5.9666 1.3278 1.3452 5.5394 1.6296 2.3898 1.5550 2.6808 1.8875 1.6321 1.4764 1.0734 1.0995 1.6784 1.2470 1.3687 1.9431 1.8342 1.2189 1.9658 2.2372 4.7408 1.7380 2.3647 1.5766 1.7066 1.4737 1.3719 1.6218 2.3668 2.2438 1.4863 1.1494 5.4025 5.0856 5.9228 5.9841 6.7303 1.0785 1.0672 1.0619 1.0931 1.1034 1.0882 1.0883 1.0894 1.0897 1.0957 1.0953 1.1004 1.1005 1.0778 1.0765
irintensity: 1.7742 2.6571 7.4016 2.5693 1.9744 1.7255 1.3771 14.6067 1.3115 0.6884 8.8027 6.0900 1.8681 3.8080 6.3179 1.5178 3.4699 9.8079 31.0056 56.8451 11.0234 5.0717 64.8954 12.5795 4.5427 9.2429 9.4206 113.3079 12.1360 13.2964 10.9349 67.3552 111.8529 5.8627 7.0912 1.3076 2.5636 7.2848 29.4536 6.5687 0.3093 1.6973 12.5082 5.9403 0.5188 1.1084 18.7141 43.2433 0.4071 51.7782 87.0184 20.8537 0.6199 5.1698 17.2277 19.3302 105.8999 26.7971 21.2659 86.1063 42.5928 10.2457 17.8667 5.3311 75.5319 13.3965 19.6341 19.4607 26.0216 168.6738 164.0770 86.4413 266.1291 195.1719 107.4372 39.0358 56.0757 20.3038 296.9339 284.8955 328.8913 1121.7509 89.9137 72.7463 57.8637 32.2480 20.5530 10.2974 3.9136 10.1603 17.8236 15.6887 25.2069 13.1025 448.9481 115.6638
temp: 298.150 k
press: 1.00000 atm
elementType: 8 7 7 7 7 7 6 6 6 6 6 6 6 6 6 6 6 6 6 1 1 1 1 1 1 1 1 1 1 1 1 1 1 1
symmnumber: 1
zpe: 707500.9 jmol-1
zpe.correction: 0.269473 hartree
zpe.thermalcorrener: 0.285734 hartree
zpe.thermalcorrenthalpy: 0.286678 hartree
zpe.thermalcorrgfe: 0.224517 hartree
zpe.sumelectzpe: -851.976946 hartree
zpe.sumelectthermal: -851.960686 hartree
zpe.sumelectthermalent: -851.959741 hartree
zpe.sumelectthermalfe: -852.021903 hartree
dipole: 1.7515 -1.8939 1.3068
dipole: 2.8918
quadrupole: -93.3060 -96.2047 -118.4062
quadrupole: 3.3290 1.0716 1.9240
quadrupole: 9.3330 6.4343 -15.7673 3.3290 1.0716 1.9240
hfenergy: -852.2464193 hartree
pointgroup: C01 [X(C13H15N5O1)]
dipole: -0.6776758 -0.6604907 -0.6316048 debye
polarizability: 239.6448275|11.1365926|204.7886864|9.0575696|-2.9304771|127.6063899 unknown
InChI: InChI=1S/C13H15N5O/c19-10-9-16-13(17-11-5-1-3-7-14-11)18-12-6-2-4-8-15-12/h1-8,17-19H,9-10H2
charge 0 multiplicity 1
34 atoms
O  1.33018 2.398949 -0.923414
N  0.226048 -0.550981 1.122547
N  -1.09926 1.225663 0.154336
N  0.723314 1.667038 1.713125
N  2.125328 -0.175283 -0.266503
N  -2.4312 -0.709179 0.513542
C  -0.045641 0.847227 1.058606
C  0.705757 3.098461 1.381654
C  1.38665 -1.034858 0.516119
C  -2.214799 0.460268 -0.176929
C  1.684221 3.28907 0.177464
C  1.770056 -2.399329 0.681971
C  -3.110146 0.910887 -1.195084
C  2.929806 -2.864718 0.042115
C  -4.248319 0.142582 -1.483081
C  3.704714 -1.97412 -0.745909
C  -4.486361 -1.05884 -0.764563
C  3.258527 -0.644478 -0.864859
C  -3.547573 -1.436335 0.21446
H  -0.623305 -1.141953 1.184953
H  -0.850513 2.01989 -0.448503
H  -0.299621 3.490448 1.109199
H  1.077835 3.670179 2.250523
H  2.719989 3.097361 0.523953
H  1.614925 4.324404 -0.200765
H  1.169814 -3.054059 1.320863
H  -2.904897 1.842278 -1.733084
H  3.238844 -3.908266 0.165483
H  -4.947006 0.472739 -2.259052
H  4.618691 -2.299301 -1.249592
H  -5.364933 -1.679274 -0.959611
H  3.80803 0.084575 -1.470693
H  -3.678033 -2.357295 0.793755
H  1.647277 1.439954 -0.697926
