program: Gaussian 09
title: 000230327
version: EM64L-G09RevD.01
frameworkgroup: C1[X(C6H10N2O2S)]
method: RPBEPBE
basis: SDD
operation: Freq
keyword: #p
keyword: freq=noraman
keyword: PBEPBE/SDD
title: #p freq=noraman PBEPBE/SDD
converged: YES YES NO NO
title: Mulliken charges:
elementType: S O O N N C C C C C C H H H H H H H H H H
charge: 0.200763 -0.404174 -0.228919 -0.065340 -0.626778 -0.380932 -0.137805 -0.699617 -0.804199 0.233656 0.159156 0.231749 0.256747 0.203381 0.265348 0.247298 0.276110 0.257206 0.325326 0.313901 0.377122
chargesum: 0.00000
title: Mulliken charges with hydrogens summed into heavy atoms:
elementType: S O O N N C C C C C C
charge: 0.200763 -0.027051 -0.228919 -0.065340 0.012449 0.107564 0.065577 -0.186971 -0.270884 0.233656 0.159156
polarizability: 1.17279476e+02 -1.01963868e+01 1.08331340e+02 -7.74865384e-01 3.57404459e+00 7.18937509e+01
1716.lowfreq: -19.8207 -12.3809 -0.0026 0.0008 0.0020 12.9046 34.5940 70.8700 123.3609
frequency: 34.1605 70.5632 123.3546 141.8963 172.7654 223.5793 247.3779 278.7175 329.8439 358.9227 401.9578 415.8136 469.3565 509.3646 536.9419 584.0123 599.5773 612.1845 626.4525 701.4601 728.9399 798.8418 811.4658 882.7955 896.6044 935.1283 982.7903 1006.5140 1063.3834 1076.6728 1104.9943 1163.0150 1181.9268 1212.2226 1226.3001 1247.1084 1271.9010 1295.3593 1324.8873 1355.1239 1385.2342 1435.1105 1439.7006 1444.8755 1600.5502 1642.9460 1665.9531 2908.2428 2994.8679 3004.9665 3020.0305 3068.4868 3085.2592 3093.6891 3510.0907 3542.9794 3701.5215
redmass: 9.1299 5.2301 5.3518 4.1694 3.8076 4.2437 3.6841 3.7307 1.2487 3.1145 2.9920 2.6393 2.7252 2.1994 2.3742 2.8925 1.5691 2.8031 3.0368 4.1673 6.1880 1.7917 3.3247 2.3199 2.1948 4.2960 2.2152 2.3651 2.4337 1.8704 1.3851 1.5314 1.3989 1.1507 1.1888 1.3614 1.3689 1.2162 1.6120 1.9535 2.7349 1.1012 1.0817 1.1669 1.4113 3.8577 9.0543 1.0807 1.0625 1.0625 1.0597 1.0979 1.1033 1.1048 1.0638 1.0454 1.1037
irintensity: 0.9272 0.2173 2.2119 0.8371 5.9537 1.4336 5.7048 0.5740 127.2550 24.5211 12.1393 10.6660 20.2926 59.9156 24.3015 45.8240 80.5047 28.2797 53.2723 61.2461 0.3112 6.4632 4.6890 6.5831 0.4083 49.8457 19.8916 70.4572 129.4678 34.4686 12.9176 8.8064 17.2193 1.6501 6.2509 2.2047 42.5810 2.7935 38.5337 30.0070 18.3092 3.2743 21.8949 34.2151 31.0447 419.7540 227.1780 43.3212 13.1017 34.5912 20.6023 10.1710 17.0966 9.6083 19.6334 53.4276 30.6568
temp: 298.150 k
press: 1.00000 atm
elementType: 16 8 8 7 7 6 6 6 6 6 6 1 1 1 1 1 1 1 1 1 1
symmnumber: 1
zpe: 427956.7 jmol-1
zpe.correction: 0.163000 hartree
zpe.thermalcorrener: 0.174382 hartree
zpe.thermalcorrenthalpy: 0.175326 hartree
zpe.thermalcorrgfe: 0.125169 hartree
zpe.sumelectzpe: -891.789769 hartree
zpe.sumelectthermal: -891.778387 hartree
zpe.sumelectthermalent: -891.777443 hartree
zpe.sumelectthermalfe: -891.827600 hartree
dipole: -1.8739 1.4511 1.9037
dipole: 3.0399
quadrupole: -72.0446 -63.7436 -74.1559
quadrupole: -4.5609 4.5893 -3.9504
quadrupole: -2.0632 6.2378 -4.1745 -4.5609 4.5893 -3.9504
hfenergy: -891.9527693 hartree
pointgroup: C01 [X(C6H10N2O2S1)]
dipole: -0.7731693 -0.3010402 -0.8613777 debye
dipolederiv: -0.1933098 -0.0007811 -0.1219028 -0.0254791 -0.1935301 0.0657933 -0.0980026 0.0402868 -0.1279823 -0.5243792 0.1845889 0.3686621 0.1779694 -0.6057948 -0.3424338 0.3401327 -0.3117479 -0.8361391 -0.7984179 -0.0848836 -0.3031122 0.1164135 -0.4200149 -0.1711923 -0.0843432 -0.2563993 -0.7475411 -1.1245565 -0.4302942 -0.0102704 -0.0233713 -0.5507799 0.0201742 -0.211353 -0.1012484 -0.3497028 -0.6155274 -0.3109577 0.1067829 -0.6251493 -1.0949759 -0.1580678 0.1837385 -0.0107867 -0.6002951 -0.1467356 -0.0351988 -0.0255152 -0.1327181 -0.0379316 -0.0290778 -0.0009604 0.0139243 0.0477235 0.3022705 0.2434984 -0.0527777 0.1429437 0.3262949 -0.061319 -0.11663 -0.0573824 0.2401329 0.2935891 0.1012708 0.0467467 0.1862407 0.1564666 -0.0543887 0.0770083 -0.0423982 0.1084976 -0.0605696 0.0859226 -0.0132313 -0.0055908 0.0250841 0.1085795 -0.0498162 0.1293857 0.1347779 1.1670376 0.5717788 0.080458 0.578279 1.0601303 -0.0982555 0.1373835 -0.2471418 0.1209064 1.273784 -0.1699264 0.0484736 -0.220368 0.5180252 0.5576528 -0.0619621 0.5914779 1.1898539 -0.0511336 -0.122183 -0.033528 -0.0980515 -0.0295005 -0.0089345 -0.0198981 -0.027552 0.0961647 0.0779935 0.0211025 0.0454871 0.0412228 0.0531054 0.0795524 0.0313138 0.035303 -0.0515893 -0.0030909 -0.023518 -0.0483597 -0.0896067 -0.0526804 0.0632563 0.0378124 0.101628 -0.1463174 0.0255194 0.0206776 0.0066245 0.023752 -0.0565055 -0.0836568 0.0215073 -0.1054556 0.0425657 -0.0384884 -0.0766192 0.037198 -0.0396163 0.0359523 0.0333008 0.0235398 0.1151032 -0.1069024 0.0442282 0.0024281 0.1438935 0.006757 0.0065469 0.0372076 0.0631745 0.0034653 -0.0325911 -0.0657258 -0.0338053 -0.0832806 -0.0773259 0.000592 -0.0727446 -0.0555111 -0.0342798 0.0772203 0.1618808 -0.014976 -0.0614931 0.021913 0.2465489 0.0653749 -0.0585514 0.0946384 0.31517 0.1598324 0.0245822 -0.0473031 0.0256508 0.2557766 0.0693415 -0.0193797 0.0817793 0.3290126 0.1157992 0.0472934 -0.0835523 0.0161351 0.3571906 -0.0201626 -0.139203 -0.0126 0.2970353 unknown
polarizability: 119.3805532|7.9544803|102.8877685|4.6119989|10.6385281|75.2362446 unknown
InChI: InChI=1S/C6H10N2O2S/c7-5-3-11-2-1-4(8-5)6(9)10/h4,9H,1-3,7H2
charge 0 multiplicity 1
21 atoms
S  -2.553014 1.395565 0.257787
O  2.698333 -0.721613 -1.059613
O  2.959989 0.347461 0.980934
N  0.020828 -0.939277 0.135079
N  -1.880119 -2.271035 0.034956
C  0.31391 1.495938 0.803187
C  0.730391 0.333228 -0.13899
C  -0.886541 2.309398 0.292763
C  -2.085282 -0.0142 -0.921324
C  -1.233597 -1.071808 -0.231391
C  2.221924 0.015381 0.029458
H  1.170633 2.189969 0.911251
H  0.111286 1.084673 1.807751
H  0.600937 0.666948 -1.195462
H  -1.085293 3.168608 0.956318
H  -0.705195 2.696247 -0.727191
H  -1.544498 0.430249 -1.775239
H  -3.039569 -0.41879 -1.296213
H  -1.358035 -2.993295 0.529005
H  -2.875686 -2.390546 -0.125427
H  3.649497 -0.967503 -0.89654
