program: Gaussian 09
title: 000230308
version: EM64L-G09RevD.01
frameworkgroup: C1[X(C10H13N3O2)]
method: RPBEPBE
basis: SDD
operation: Freq
keyword: #p
keyword: freq=noraman
keyword: PBEPBE/SDD
title: #p freq=noraman PBEPBE/SDD
converged: YES YES NO NO
title: Mulliken charges:
elementType: O O N N N C C C C C C C C C C H H H H H H H H H H H H H
charge: -0.264206 -0.251959 -0.000117 -0.402421 -0.652296 0.347876 0.072528 -0.360974 -0.363429 0.326878 -0.377853 -0.355791 -0.810714 -0.537115 0.296278 0.206958 0.293493 0.247391 0.241542 0.255155 0.237702 0.232903 0.285272 0.223320 0.223369 0.243926 0.298367 0.343918
chargesum: 0.00000
title: Mulliken charges with hydrogens summed into heavy atoms:
elementType: O O N N N C C C C C C C C C C
charge: -0.264206 -0.251959 -0.000117 -0.117149 -0.010011 0.347876 0.072528 -0.154016 -0.069936 0.326878 -0.130462 -0.114249 -0.084954 0.153500 0.296278
polarizability: 2.70900809e+02 1.16639896e+00 1.45431281e+02 -4.29892948e-02 -8.33463426e-01 6.54099725e+01
1716.lowfreq: -12.0480 -0.0004 0.0003 0.0006 5.8419 7.7477 11.8354 28.5092 62.7146
frequency: -10.1551 28.3600 62.6794 68.6648 86.4056 104.4397 136.4697 178.2788 218.0946 244.9302 259.3869 264.1461 283.0170 308.0778 379.5517 413.7287 414.3997 453.2969 470.3936 495.3921 511.0351 534.2051 569.6490 581.8318 621.0384 634.0389 707.2494 709.1134 735.7239 790.5001 815.7838 839.3826 929.3847 947.3973 964.8760 985.5046 991.5194 998.1783 1028.0807 1040.8021 1069.9812 1111.2779 1115.5043 1143.1214 1160.0338 1181.3791 1236.1861 1291.3052 1304.1612 1326.6733 1364.1175 1391.8456 1424.3047 1436.9663 1455.8442 1467.0323 1472.8030 1482.7025 1494.0791 1520.8198 1548.6593 1579.3823 1602.7734 1621.2390 1681.2924 2958.2761 2961.6994 3024.3732 3050.4808 3125.2767 3128.7768 3142.1928 3149.9060 3167.2188 3171.1223 3411.9963 3537.7685 3696.4573
redmass: 2.8023 4.1047 3.8674 5.4789 1.7181 2.0085 3.9195 4.3732 1.3696 1.3474 6.2167 3.7733 2.2205 3.4757 4.1584 3.6579 3.3858 3.7836 1.4245 1.4921 3.4926 1.8345 4.4156 2.2440 5.9357 6.8922 3.8080 8.4375 3.7330 5.4888 1.3071 1.5780 3.0474 1.3737 2.1662 8.7713 1.3433 2.7688 1.5562 2.4156 2.6823 1.2603 1.7158 2.4742 1.3608 1.2885 2.7448 2.5735 1.3282 3.7623 4.7479 1.2668 3.5690 1.2169 1.2526 1.0500 1.0753 1.0496 1.8665 1.8638 7.9664 6.7291 1.2162 6.3541 5.3383 1.0425 1.0328 1.0975 1.1041 1.0996 1.0918 1.0863 1.0877 1.0954 1.0965 1.0744 1.0459 1.1034
irintensity: 0.1606 24.0099 2.9220 8.2172 0.4811 0.0582 6.4424 1.0684 0.0390 4.2957 1.3147 2.6038 21.5365 1.1601 34.7965 16.2297 9.5516 1.5803 238.0482 34.4078 13.0216 99.8183 5.7389 24.3466 0.6226 1.5002 32.5597 18.1735 1.2487 1.2236 10.7827 73.2564 0.2741 0.3563 6.8263 55.9248 2.7794 14.2417 1.9253 47.2425 5.7172 0.3269 84.9733 110.4570 3.7228 127.3894 203.4034 533.0851 0.8016 100.0107 5.3316 34.5544 1.4139 7.6171 191.4511 13.4579 75.7858 18.2379 323.6610 44.6477 26.3764 3.4973 161.4463 108.7881 263.7493 22.9051 72.4537 20.4763 47.8617 28.4118 9.2901 18.3319 5.6456 15.6190 7.6182 14.7713 58.6529 45.5056
temp: 298.150 k
press: 1.00000 atm
elementType: 8 8 7 7 7 6 6 6 6 6 6 6 6 6 6 1 1 1 1 1 1 1 1 1 1 1 1 1
symmnumber: 1
zpe: 579076.5 jmol-1
zpe.correction: 0.220559 hartree
zpe.thermalcorrener: 0.235271 hartree
zpe.thermalcorrenthalpy: 0.236216 hartree
zpe.thermalcorrgfe: 0.178047 hartree
zpe.sumelectzpe: -702.427197 hartree
zpe.sumelectthermal: -702.412484 hartree
zpe.sumelectthermalent: -702.411540 hartree
zpe.sumelectthermalfe: -702.469709 hartree
dipole: 1.7698 3.8560 -0.0861
dipole: 4.2436
quadrupole: -56.8163 -83.2705 -93.0491
quadrupole: 25.4947 -0.9983 -0.1246
quadrupole: 20.8957 -5.5585 -15.3372 25.4947 -0.9983 -0.1246
hfenergy: -702.6477555 hartree
pointgroup: C01 [X(C10H13N3O2)]
dipole: -0.6537038 -1.5322407 -0.1113698 debye
polarizability: 270.6881866|4.8809336|145.2497276|-2.8416434|5.3161824|65.8041477 unknown
InChI: InChI=1S/C10H13N3O2/c1-7(12-13-10(11)14)8-3-5-9(15-2)6-4-8/h3-6,13H,11H2,1-2H3
charge 0 multiplicity 1
28 atoms
O  4.603108 0.380439 0.028198
O  -3.770652 2.014406 0.29598
N  -1.818553 -0.002743 0.120579
N  -3.172015 -0.273145 0.128577
N  -5.421701 0.371797 0.159252
C  0.47452 -0.659461 0.064993
C  -0.967546 -1.020139 0.076141
C  1.513202 -1.628777 -0.042816
C  0.860306 0.709368 0.160977
C  3.226632 0.112307 0.04568
C  2.868644 -1.253508 -0.05281
C  2.211032 1.099383 0.152926
C  -1.43403 -2.469158 0.038723
C  5.021763 1.781225 0.129549
C  -4.091445 0.803668 0.200576
H  1.280605 -2.695226 -0.126564
H  0.069037 1.460699 0.241632
H  3.664016 -2.000161 -0.136803
H  2.460586 2.161939 0.230805
H  -0.598348 -3.180612 0.063969
H  -2.016281 -2.680639 -0.881487
H  -2.080297 -2.702591 0.909687
H  -3.526858 -1.237726 0.094439
H  4.688648 2.232533 1.084206
H  4.635181 2.379413 -0.718222
H  6.12076 1.755202 0.094761
H  -5.711123 -0.596246 0.035464
H  -6.133493 1.095253 0.217686
