program: Gaussian 09
title: 000230307
version: EM64L-G09RevD.01
frameworkgroup: C1[X(C8H9IO2)]
method: RPBEPBE
basis: SDD
operation: Freq
keyword: #pfreq=noraman
keyword: PBEPBE/SDD
title: #p freq=noraman PBEPBE/SDD
converged: NO YES NO NO
title: Mulliken charges:
elementType: I O O C C C C C C C C H H H H H H H H H
charge: 0.083821 -0.279512 -0.291236 0.245429 0.228234 -0.253738 -0.310412 -0.337863 -0.204615 -0.493775 -0.535904 0.274432 0.243623 0.246771 0.226223 0.232044 0.231350 0.225613 0.244076 0.225439
chargesum: 0.00000
title: Mulliken charges with hydrogens summed into heavy atoms:
elementType: I O O C C C C C C C C
charge: 0.083821 -0.279512 -0.291236 0.245429 0.228234 0.020694 -0.066789 -0.337863 0.042156 0.195842 0.159225
polarizability: 1.90961747e+02 -5.84695267e-01 1.13198960e+02 -2.02453807e-02 1.32115397e-02 5.04717903e+01
1716.lowfreq: -60.3103 -7.0347 -0.0007 -0.0006 -0.0002 10.1597 13.2215 60.2995 113.6192
frequency: -60.3036 60.2928 113.6181 137.9721 164.6591 184.9894 206.0988 227.4567 251.9405 303.6631 335.7095 351.7807 454.3749 458.1326 562.2815 583.1121 608.0366 698.5597 700.8296 782.8149 797.7932 869.7574 910.4081 976.2089 980.0440 1072.1278 1107.2497 1110.7107 1118.1380 1149.2005 1157.0561 1196.5378 1243.4968 1261.4897 1371.9408 1375.8479 1433.1592 1444.5924 1457.8021 1462.7498 1466.9577 1470.2824 1482.2805 1568.9553 1587.6734 2961.3964 2999.5864 3050.4736 3107.8329 3122.9841 3124.1203 3156.2273 3178.5624 3181.7406
redmass: 3.1140 3.7713 5.0128 6.3117 2.2564 4.8075 1.3644 5.7823 1.2122 3.5379 4.1309 4.2424 3.1734 5.4459 4.9114 6.5879 5.3597 3.5599 5.4586 1.4317 7.0447 1.4317 1.3320 9.1281 8.8470 1.9663 1.2419 1.2553 2.0443 1.3670 1.5180 2.0328 2.4528 1.5561 5.6821 3.6902 1.2100 1.2603 1.0529 1.0585 1.0507 1.5545 1.4023 8.5803 6.5778 1.0325 1.0284 1.1042 1.1051 1.1052 1.0997 1.0873 1.0944 1.0941
irintensity: 9.7018 3.3607 2.6403 1.0060 0.2318 2.9354 0.2874 0.4263 0.1914 5.5732 2.1123 2.6781 4.3697 7.0379 11.2117 8.3712 15.6963 0.0826 8.1902 48.9176 21.3989 28.5814 0.4038 130.4374 32.7700 1.8366 0.1441 0.0416 86.2024 0.6162 29.0525 75.7492 146.2026 88.9960 18.4473 61.3110 23.6770 6.1992 12.7849 46.8001 12.0725 238.4981 45.9648 32.6741 40.0430 65.8642 72.5920 44.0923 38.0521 26.6362 22.3793 5.5633 5.1466 2.0593
temp: 298.150 k
press: 1.00000 atm
elementType: 53 8 8 6 6 6 6 6 6 6 6 1 1 1 1 1 1 1 1 1
symmnumber: 1
zpe: 395615.3 jmol-1
zpe.correction: 0.150682 hartree
zpe.thermalcorrener: 0.161463 hartree
zpe.thermalcorrenthalpy: 0.162408 hartree
zpe.thermalcorrgfe: 0.112579 hartree
zpe.sumelectzpe: -471.338785 hartree
zpe.sumelectthermal: -471.328003 hartree
zpe.sumelectthermalent: -471.327059 hartree
zpe.sumelectthermalfe: -471.376888 hartree
dipole: 4.2150 -2.1662 0.0205
dipole: 4.7391
quadrupole: -62.5325 -71.2288 -83.1025
quadrupole: -4.9573 0.0507 0.0156
quadrupole: 9.7554 1.0592 -10.8146 -4.9573 0.0507 0.0156
hfenergy: -471.4894668 hartree
pointgroup: C01 [X(C8H9I1O2)]
dipole: -1.6998353 0.7428423 -0.187548 debye
dipolederiv: -0.5295021 0.0165085 -0.0598918 0.0244417 -0.0386573 0.0028056 -0.0611575 0.0019081 -0.0235502 -0.9442478 -0.6487967 -0.0730739 -0.8964288 -1.1708623 -0.1020219 -0.0740513 -0.0755911 -0.310538 -1.6041695 0.4553161 -0.1528531 0.3487078 -0.504039 0.0394279 -0.1532883 0.0513456 -0.2791054 0.2706873 0.5644038 0.021054 0.9759507 1.1414207 0.1114354 0.0223288 0.0659128 0.0996169 1.3497603 -0.2237589 0.1500727 -0.2958916 -0.2220226 -0.0343361 0.1497881 -0.0265086 0.0524914 -0.4936511 -0.3558425 -0.0429441 0.0840986 -0.1145076 0.009592 -0.0435656 -0.0405715 -0.1311068 -0.0541331 0.0885831 0.0135921 0.0132107 0.0274065 0.0021494 0.0133073 0.010073 -0.1704453 1.1779759 0.0424338 0.158473 -0.1611721 0.095904 -0.0183238 0.160585 0.0049362 -0.1529975 -0.5139282 0.0213708 -0.0441815 -0.0338754 -0.0504334 -0.0037202 -0.0455225 0.0026008 -0.1417895 0.8002698 0.4306555 0.0542968 0.173653 0.3812969 0.0194741 0.0539181 0.0481912 0.3157223 0.5072524 -0.1983734 0.0203064 -0.518382 0.5493078 -0.058479 0.0194278 -0.0216322 0.3255324 0.098886 0.0525633 -0.0083827 0.0466457 0.0102838 0.0055096 -0.008734 0.0062469 0.1701949 0.0106501 0.0866751 -0.0178153 0.0847917 -0.039278 0.0095252 -0.0173327 0.0099255 0.1635852 0.0522414 -0.0731047 -0.0138521 -0.0696355 -0.0133908 -0.0081604 -0.0137595 -0.0085854 0.1709179 0.0357032 -0.0257643 -0.0088822 -0.0911806 -0.1820225 -0.0114883 -0.0090446 -0.0039546 0.1158696 -0.0540108 -0.0774499 -0.0537764 0.0599921 0.0874303 0.0974663 -0.0931567 0.0444589 -0.0922908 -0.0877878 -0.0676342 0.0548605 0.078398 0.0874669 -0.0813463 0.0959772 -0.0585346 -0.0620236 0.0753813 -0.0357092 -0.0608759 0.1248132 -0.0622505 -0.0734438 0.0044841 -0.114427 -0.0956525 -0.1515913 0.0095813 -0.0315082 -0.0523097 0.0810608 -0.0063348 -0.0315508 0.0008555 0.1178455 0.0542142 -0.0616573 0.0953817 0.1041723 -0.0641135 0.1002693 0.0313471 0.1033504 -0.0722763 unknown
polarizability: 188.8647984|4.4248303|113.4506955|15.9801437|0.5246244|52.3170035 unknown
InChI: InChI=1S/C8H9IO2/c1-10-7-4-3-6(9)5-8(7)11-2/h3-5H,1-2H3
charge 0 multiplicity 1
20 atoms
I  4.321528 0.173393 0.381211
O  -0.537893 -2.151988 -0.184771
O  -2.025714 0.388111 -0.352904
C  0.035125 -0.879156 -0.11841
C  -0.62546 0.39061 -0.192795
C  1.442324 -0.910137 0.043214
C  0.144543 1.57469 -0.103523
C  2.183074 0.283122 0.129105
C  1.548583 1.538064 0.057248
C  -1.986349 -2.376083 -0.343978
C  -2.701751 1.685816 -0.424869
H  1.916312 -1.893062 0.09861
H  -0.346382 2.550564 -0.158796
H  2.117235 2.469042 0.123375
H  -2.081011 -3.473146 -0.359963
H  -2.358173 -1.943402 -1.28705
H  -2.552514 -1.952944 0.501828
H  -2.556355 2.267144 0.506313
H  -3.768047 1.445707 -0.549001
H  -2.349075 2.276056 -1.292844
