program: Gaussian 09
title: 000230291
version: EM64L-G09RevD.01
frameworkgroup: C1[X(C7H3Cl3N2O)]
method: RPBEPBE
basis: SDD
operation: Freq
keyword: #p
keyword: freq=noraman
keyword: PBEPBE/SDD
title: #p freq=noraman PBEPBE/SDD
converged: NO YES NO NO
title: Mulliken charges:
elementType: Cl Cl Cl O N N C C C C C C C H H H
charge: 0.037307 -0.005548 -0.006724 -0.251641 -0.076615 -0.580966 0.241435 0.438662 -0.277536 -0.309671 -0.087048 -0.257865 0.144863 0.282384 0.352844 0.356120
chargesum: 0.00000
title: Mulliken charges with hydrogens summed into heavy atoms:
elementType: Cl Cl Cl O N N C C C C C C C
charge: 0.037307 -0.005548 -0.006724 -0.251641 -0.076615 0.127998 0.241435 0.438662 -0.277536 -0.309671 -0.087048 0.024519 0.144863
polarizability: 1.78585080e+02 -6.12076085e+00 1.49714640e+02 -2.18834501e-03 -1.26049246e-02 4.44972066e+01
1716.lowfreq: -4.7530 -1.4642 -0.0027 -0.0023 0.0008 3.3210 66.9352 106.7134 150.1742
frequency: 66.9347 106.7133 150.1742 175.0908 177.3317 186.4436 187.7648 306.4696 311.3330 343.3192 354.5349 366.8416 385.4554 475.9504 506.2706 543.0228 547.7319 592.6568 596.2404 670.9294 713.9547 740.3658 759.5416 826.0447 828.3170 909.2237 932.0528 1050.4352 1130.4647 1173.5819 1223.6286 1299.1810 1324.1265 1414.3257 1421.2030 1561.1308 1587.5783 1617.7150 1683.6517 3187.7244 3572.1648 3719.9968
redmass: 17.1750 9.3399 10.2047 11.0682 16.4199 6.9351 16.8575 24.3524 5.4964 8.9427 5.4254 8.8835 1.1409 1.2189 9.0153 4.5479 7.5773 5.7659 7.7911 11.9085 9.1228 9.3242 11.6164 1.4186 7.3102 9.7997 8.3300 2.4934 4.4515 2.1013 4.8889 3.6838 7.3825 8.9549 5.1894 6.1747 1.3215 10.6012 6.2304 1.0926 1.0451 1.1059
irintensity: 0.9540 2.8797 2.8833 0.0154 0.4936 5.1966 1.1019 0.0874 0.1566 1.9418 1.7726 0.0007 41.6730 311.3177 10.8702 4.4379 5.7981 11.9903 0.4372 17.6733 27.7064 0.0405 38.8847 22.3403 45.9557 32.3305 74.9008 32.2904 58.9765 20.4771 16.3430 64.0300 56.2530 68.3936 68.4326 159.7875 19.7992 54.2912 728.5897 3.4281 224.4519 72.0932
temp: 298.150 k
press: 1.00000 atm
elementType: 17 17 17 8 7 7 6 6 6 6 6 6 6 1 1 1
symmnumber: 1
zpe: 237623.9 jmol-1
zpe.correction: 0.090506 hartree
zpe.thermalcorrener: 0.102044 hartree
zpe.thermalcorrenthalpy: 0.102988 hartree
zpe.thermalcorrgfe: 0.052076 hartree
zpe.sumelectzpe: -1832.525158 hartree
zpe.sumelectthermal: -1832.513621 hartree
zpe.sumelectthermalent: -1832.512677 hartree
zpe.sumelectthermalfe: -1832.563589 hartree
dipole: 4.5839 -0.9053 0.0125
dipole: 4.6725
quadrupole: -78.1258 -91.4044 -96.3090
quadrupole: -15.4155 0.0210 -0.0666
quadrupole: 10.4873 -2.7913 -7.6960 -15.4155 0.0210 -0.0666
hfenergy: -1832.6156644 hartree
pointgroup: C01 [X(C7H3Cl3N2O1)]
dipole: -1.8133722 -0.3016618 0.0050534 debye
dipolederiv: -0.0660479 -0.1472446 0.0001497 -0.2208379 -0.6429192 0.0006469 0.0002177 0.0007347 0.0024144 -0.1304562 -0.1581505 0.0000865 -0.1136767 -0.7464591 0.0004724 0.0002451 0.0005708 -0.022188 -0.717863 -0.1325693 0.0000406 -0.1278182 -0.0939418 0.0000401 0.0000281 0.0000339 -0.0316887 -0.9233827 0.1632467 0.0002546 0.2398712 -0.6678633 0.0004437 0.0031688 -0.000527 -0.1004058 -1.4515298 0.1374136 -0.000292 -0.280166 -0.3962656 -0.0006433 -0.000862 0.0001423 -0.2609729 -1.8989911 0.2491953 0.0008882 0.2181458 -0.2585731 0.005136 -0.0020837 0.005163 -0.7070246 0.7607243 -0.2208655 0.0010766 -0.6184889 0.0001606 0.0001596 0.0014373 0.0002769 0.0902923 0.5203329 -0.2105534 0.0001261 0.4211372 -0.3463373 0.0005919 -0.0005102 0.0007714 0.0814704 -0.2154963 0.3143926 -0.0007016 0.2252456 0.9737204 -0.0011628 -0.0003091 -0.0013542 -0.0890181 0.3705416 0.2227096 -0.000271 0.0543915 1.1572783 -0.0007587 -0.0000218 -0.0009864 -0.0791837 1.0810618 0.0676417 0.0001994 0.287079 0.007542 -0.0000509 0.0001703 0.000038 -0.0418903 -0.4696222 -0.0312659 0.0000836 -0.1161635 -0.3184532 0.0001831 -0.0001938 -0.0001215 -0.0857835 2.4761493 -0.2472259 -0.00133 0.0507921 0.8651893 -0.0019826 -0.0023022 -0.0015336 0.2406107 0.0685409 0.0306315 -0.0000773 0.0244464 0.0567675 0.0001358 -0.0001313 0.0002379 0.178326 0.3252444 0.009118 0.0003275 0.1135226 0.1753971 -0.0015632 -0.0018096 -0.0013806 0.4141093 0.270794 -0.0464741 -0.0005609 -0.1574805 0.2347574 -0.0016483 0.0029563 -0.0020656 0.4109324 unknown
polarizability: 179.0399846|4.9115674|149.2596815|0.0026335|-0.0757842|44.4972601 unknown
InChI: InChI=1S/C7H3Cl3N2O/c8-2-1-3(9)6-5(4(2)10)12-7(11)13-6/h1H,11H2
charge 0 multiplicity 1
16 atoms
Cl 1.524568 2.823241 -0.003328
Cl -0.095043 -3.451704 0.001933
Cl 3.831975 0.474822 -0.000196
O  -2.002917 -0.80787 0.000137
N  -1.446314 1.464642 -0.00418
N  -3.771358 0.760325 -0.000742
C  -0.261501 0.691769 -0.001018
C  -0.592112 -0.697031 0.000688
C  1.094737 1.078951 -0.001305
C  0.369656 -1.704823 0.001056
C  2.069184 0.054489 0.000022
C  1.727416 -1.320314 0.001169
C  -2.42538 0.564689 -0.000452
H  2.514413 -2.077585 0.002162
H  -4.407006 -0.032135 -0.007355
H  -4.127819 1.711733 0.009713
