program: Gaussian 09
title: 000230283
version: EM64L-G09RevD.01
frameworkgroup: C1[X(C11H10INO2)]
method: RPBEPBE
basis: SDD
operation: Freq
keyword: #p
keyword: freq=noraman
keyword: PBEPBE/SDD
title: #p freq=noraman PBEPBE/SDD
converged: NO NO NO NO
title: Mulliken charges:
elementType: I O O N C C C C C C C C C C C H H H H H H H H H H
charge: 0.037693 -0.198930 -0.198901 -0.224544 -0.345321 0.183267 0.183567 -0.299367 0.087671 0.087735 -0.351908 -0.351910 -0.785186 -0.209999 -0.210029 0.241603 0.241656 0.252203 0.252608 0.270782 0.270793 0.292959 0.292945 0.240300 0.240311
chargesum: 0.00000
title: Mulliken charges with hydrogens summed into heavy atoms:
elementType: I O O N C C C C C C C C C C C
charge: 0.037693 -0.198930 -0.198901 -0.224544 0.137938 0.183267 0.183567 0.205444 0.087671 0.087735 -0.081126 -0.081117 -0.199282 0.030302 0.030282
polarizability: 2.14828563e+02 2.06925671e-02 1.42685358e+02 -1.52898814e+01 -6.28844184e-02 9.89002049e+01
1716.lowfreq: -25.1833 -4.4549 -3.9734 -0.0006 -0.0003 0.0004 9.4891 30.0750 57.2676
frequency: -14.5857 30.0616 56.6694 75.3552 93.0228 138.3412 167.7744 189.4118 214.5910 229.0621 259.1020 328.5319 378.0574 416.6187 455.7226 506.2821 522.8111 568.8181 622.0835 659.0097 677.0770 702.1343 717.6498 743.1283 784.2674 789.7661 796.5464 858.3315 907.0429 954.4839 975.2268 978.7133 1007.0035 1010.2720 1019.8453 1046.5355 1055.9689 1072.8691 1168.1750 1171.1406 1202.1801 1207.5755 1210.2153 1281.9812 1284.2500 1301.5891 1329.6577 1336.6093 1368.1593 1415.7997 1443.1039 1450.0141 1453.7935 1456.5097 1475.1661 1614.3893 1616.6904 1625.2729 1672.8037 3011.0965 3020.7654 3049.3124 3067.9592 3090.7419 3135.1281 3140.2168 3153.6666 3165.2400 3175.0590
redmass: 5.3528 8.0930 2.0183 3.0854 10.7112 4.9767 7.7067 6.3751 5.6629 3.9854 3.4532 10.3747 4.4645 3.4282 4.8615 5.7718 7.2177 7.9336 7.0714 4.8034 5.1777 5.0865 3.1676 1.1234 3.5208 1.8155 1.6822 3.4520 1.3919 6.8877 1.4129 1.8267 1.3479 3.0907 2.5343 1.5418 3.8593 2.6738 1.1996 2.0128 1.7253 1.6422 1.8557 1.2501 1.3788 1.2814 1.2162 3.4863 1.6945 5.9897 1.1330 1.3949 2.4665 1.7441 1.0890 7.6876 8.4396 10.6609 11.7116 1.0589 1.0586 1.0559 1.1042 1.1066 1.1106 1.0865 1.0906 1.0957 1.1004
irintensity: 0.0087 0.8827 0.6207 0.8690 4.4861 0.0014 1.7566 4.7234 2.4972 0.4134 3.1892 21.0886 7.9264 2.6395 0.0000 11.8048 9.2563 9.4502 3.1000 0.0163 0.2381 9.4740 79.4433 12.8596 0.1318 0.7898 30.7987 10.0973 0.0112 23.5976 2.1665 59.6207 0.0015 3.8493 2.3201 29.9117 5.1620 8.3814 9.3806 3.6783 21.4344 33.4573 16.1513 0.7212 0.0036 19.7290 9.2355 300.1319 80.3065 9.2466 4.5519 16.0108 12.0321 15.4855 10.8175 1.7409 159.8119 293.3702 42.3542 5.7854 21.6034 21.3372 0.2740 5.4108 8.0052 1.6831 5.0239 5.3557 20.3116
temp: 298.150 k
press: 1.00000 atm
elementType: 53 8 8 7 6 6 6 6 6 6 6 6 6 6 6 1 1 1 1 1 1 1 1 1 1
symmnumber: 1
zpe: 491081.7 jmol-1
zpe.correction: 0.187043 hartree
zpe.thermalcorrener: 0.199953 hartree
zpe.thermalcorrenthalpy: 0.200897 hartree
zpe.thermalcorrgfe: 0.144611 hartree
zpe.sumelectzpe: -640.838332 hartree
zpe.sumelectthermal: -640.825423 hartree
zpe.sumelectthermalent: -640.824478 hartree
zpe.sumelectthermalfe: -640.880764 hartree
dipole: 4.1767 -0.0010 -0.0416
dipole: 4.1769
quadrupole: -83.2032 -112.2040 -98.8185
quadrupole: -0.1397 -11.1184 0.1020
quadrupole: 14.8720 -14.1288 -0.7433 -0.1397 -11.1184 0.1020
hfenergy: -641.0253754 hartree
pointgroup: C01 [X(C11H10I1N1O2)]
dipole: 1.6271939 0.0073097 0.2295426 debye
dipolederiv: -0.4162352 0.0014011 -0.1175581 0.0071667 -0.0917758 0.0043877 -0.2663243 0.0027847 -0.2328683 -0.6155454 0.2447285 0.073769 0.0746618 -0.9981597 -0.1179494 0.0726332 -0.1088679 -0.3490583 -0.6106899 -0.2437496 0.0502889 -0.0745044 -1.0179486 0.0593579 0.0642219 0.0506038 -0.3339656 -1.2133571 -0.0035187 0.0446208 -0.0075017 -1.1924967 -0.0409605 0.1550546 -0.0397996 -0.280603 0.6198924 0.0061521 -0.0340317 0.0013929 0.1418563 -0.0089172 0.0530126 -0.0080361 0.3340717 -0.4427913 0.1617766 0.0843981 0.154863 -0.0724052 -0.0531038 0.1336382 -0.054063 -0.0328297 -0.4374601 -0.1754056 0.068423 -0.1723886 -0.0875005 0.0497211 0.1180678 0.0517096 -0.0236436 -0.1772663 -0.0028666 0.0058251 0.0062866 0.088134 0.0098274 -0.2257836 0.007374 -0.1645952 1.2308536 0.0410413 -0.1995703 0.2371744 1.4742952 0.140919 -0.2530219 0.0561482 0.2827822 1.2361291 -0.0260582 -0.2008105 -0.2165721 1.476557 -0.037188 -0.2729916 0.0461896 0.2746739 -0.0929506 -0.0796117 0.0039306 0.1040895 0.1371416 -0.005183 0.0053142 0.0320963 -0.0969485 -0.0922395 0.0751564 0.010564 -0.1080087 0.1367624 0.0264673 -0.0038126 -0.0108979 -0.0974641 0.5416351 -0.0081489 0.3298379 -0.0089274 0.0695903 -0.0093716 0.3513943 -0.009018 0.394081 0.0972704 0.1112666 -0.0731024 0.0853327 -0.0360615 -0.0091916 -0.0644648 -0.0273263 -0.1192415 0.1004751 -0.1021256 -0.082934 -0.0768579 -0.043307 0.0149634 -0.0724456 0.0332181 -0.1153639 0.0260306 -0.0026528 0.0133716 -0.0626283 -0.0043406 0.113785 0.0009756 0.0461284 0.0362633 0.0259941 0.0017709 0.0154873 0.0632898 0.0104728 -0.1151696 0.0070853 -0.048018 0.0236941 0.0609333 -0.0445479 0.0094989 -0.0380912 -0.0251869 0.0795813 0.0528475 0.0569324 0.0262992 0.0599243 0.0452348 0.0148133 0.0351118 -0.0123034 -0.0822232 0.0572048 -0.0585161 0.0157684 0.1087834 0.023119 0.0173861 -0.0199093 -0.0245429 -0.0037521 0.0130569 -0.0146223 0.1531173 0.1088485 -0.0222796 0.015429 0.0208551 -0.0246307 -0.0120498 0.0148062 -0.0011808 0.1533205 -0.0047935 0.0171063 -0.080566 -0.0522394 -0.0101504 0.0813437 -0.0328284 0.0931331 -0.0592751 -0.0057211 -0.011047 -0.0802288 0.0545427 0.0038763 -0.0779815 -0.0269069 -0.0887519 -0.0723874 -0.0525637 -0.0767218 0.0520724 -0.0835387 0.0478603 0.0182029 0.055854 0.0171729 0.1440073 -0.0551562 0.0699805 0.0590857 0.0764007 0.0542638 -0.0255152 0.0634126 -0.0243935 0.1401654 unknown
polarizability: 216.7487866|0.7740086|142.5861941|2.5280929|2.2408561|97.0791459 unknown
InChI: InChI=1S/C11H10INO2/c12-6-3-7-13-10(14)8-4-1-2-5-9(8)11(13)15/h1-2,4-5H,3,6-7H2
charge 0 multiplicity 1
25 atoms
I  -5.801117 0.001901 -1.542061
O  -0.302194 2.327253 0.644465
O  -0.26184 -2.377485 0.434301
N  -0.61205 -0.032047 0.63016
C  -2.028464 -0.061405 1.011143
C  1.515256 0.720979 0.054343
C  1.527326 -0.694229 -0.009254
C  -2.958752 -0.020924 -0.234405
C  0.144033 1.166409 0.462685
C  0.164412 -1.19762 0.356972
C  2.660382 1.476812 -0.237494
C  2.684766 -1.401372 -0.367134
C  -4.426824 -0.052006 0.202831
C  3.836953 0.770919 -0.601544
C  3.848913 -0.64586 -0.665506
H  -2.200032 -0.987905 1.587956
H  -2.217646 0.812202 1.660378
H  -2.754157 0.897828 -0.811911
H  -2.736706 -0.887379 -0.881994
H  2.639932 2.569721 -0.184099
H  2.682705 -2.494854 -0.4122
H  -4.696231 -0.979628 0.731458
H  -4.713492 0.826781 0.801201
H  4.750525 1.327037 -0.837254
H  4.771505 -1.163032 -0.949739
