program: Gaussian 09
title: 000230282
version: EM64L-G09RevD.01
frameworkgroup: C1[X(C9H6N2)]
method: RPBEPBE
basis: SDD
operation: Freq
keyword: #p
keyword: freq=noraman
keyword: PBEPBE/SDD
title: #p freq=noraman PBEPBE/SDD
converged: NO YES NO NO
title: Mulliken charges:
elementType: N N C C C C C C C C C H H H H H H
charge: -0.404797 -0.047158 0.150309 0.250638 0.236432 -0.338252 -0.370241 -0.342890 -0.235008 -0.208230 -0.235079 0.319432 0.282462 0.252137 0.233205 0.229035 0.228004
chargesum: 0.00000
title: Mulliken charges with hydrogens summed into heavy atoms:
elementType: N N C C C C C C C C C
charge: -0.085365 -0.047158 0.150309 0.250638 0.236432 -0.055790 -0.118104 -0.109686 -0.005973 0.019774 -0.235079
polarizability: 1.54830365e+02 -2.57175036e+00 1.19046826e+02 -7.90770485e-03 4.25872395e-03 4.22845732e+01
1716.lowfreq: -9.9588 -0.0009 -0.0008 -0.0005 7.0913 9.8482 116.7725 120.2405 214.8796
frequency: 116.7664 120.2388 214.8786 267.7367 369.5148 422.2249 483.0898 495.8204 524.3319 566.6854 578.1222 599.4831 641.4123 672.4745 756.5264 761.2687 771.9511 823.9787 862.0691 868.3804 944.3896 982.9466 1012.1755 1050.9819 1103.5640 1138.8405 1169.6996 1241.9621 1248.2119 1295.1149 1334.0645 1388.3451 1421.9125 1456.8308 1485.7324 1536.5820 1590.7551 1634.4031 2178.5759 3132.0967 3141.6227 3154.7855 3169.8611 3241.4054 3604.7737
redmass: 5.6806 8.3498 4.1030 5.7389 5.9797 2.8912 7.2801 8.1393 6.7010 2.0719 1.5509 6.7489 3.1044 7.2065 1.3193 5.5121 3.6542 1.4749 1.4774 5.1432 1.3762 1.3137 2.1333 5.1240 1.6147 1.3527 1.0940 1.9314 2.1320 2.4983 2.2558 3.8776 2.6998 3.6172 3.0062 5.4492 6.3774 7.0698 12.5976 1.0857 1.0895 1.0957 1.1004 1.0993 1.0812
irintensity: 0.3140 2.9876 11.0576 0.0021 3.3851 11.4494 1.3025 0.0024 0.1301 47.3159 61.7262 0.9782 2.4164 0.3923 119.0522 3.9073 5.8592 17.0116 0.1203 1.2201 3.1853 0.0366 8.5855 8.0353 29.3695 4.8528 0.3812 1.3825 34.1648 1.5932 12.8219 45.5826 11.2698 19.7324 1.8582 30.7268 1.4107 1.8773 92.5953 0.2811 7.0674 20.8655 20.5695 1.0530 80.4325
temp: 298.150 k
press: 1.00000 atm
elementType: 7 7 6 6 6 6 6 6 6 6 6 1 1 1 1 1 1
symmnumber: 1
zpe: 332421.8 jmol-1
zpe.correction: 0.126613 hartree
zpe.thermalcorrener: 0.134684 hartree
zpe.thermalcorrenthalpy: 0.135628 hartree
zpe.thermalcorrgfe: 0.093534 hartree
zpe.sumelectzpe: -455.319447 hartree
zpe.sumelectthermal: -455.311376 hartree
zpe.sumelectthermalent: -455.310432 hartree
zpe.sumelectthermalfe: -455.352526 hartree
dipole: -4.3192 4.5708 0.0005
dipole: 6.2887
quadrupole: -73.1844 -49.1586 -67.6593
quadrupole: 8.5825 0.0000 0.0010
quadrupole: -9.8503 14.1755 -4.3252 8.5825 0.0000 0.0010
hfenergy: -455.4460597 hartree
pointgroup: C01[X(C9H6N2)]
dipole: -1.7202796 1.7782447 0.0001872 debye
dipolederiv: -0.6834662 0.3945604 0.0000332 -0.0162988 -0.5376847 -0.000008 0.0000475 -0.0000529 -0.2696236 -0.5613731 0.1079446 0.0000656 0.2308224 -0.3110951 -0.0000446 0.0000165 -0.0000106 -0.2626838 0.315882 0.1748216 -0.0000034 0.0744778 -0.1804883 -0.0000146 -0.0000136 -0.0000375 0.0089937 0.0497452 0.1176167 0.0000173 0.4734355 0.2491559 -0.0000171 0.0000283 -0.0000009 0.0333107 -0.18153 0.1015967 0.0000098 0.3932895 -0.1917046 -0.0000438 0.0000237 -0.0000096 0.0088221 0.2768269 -0.5316038 -0.0000666 -0.5282585 0.3715416 0.000061 -0.0000556 0.0000889 -0.1124985 0.0204222 -0.0270079 -0.0000211 -0.0015281 0.1082405 0.0000193 -0.0000161 0.000017 -0.1423278 0.075578 -0.0504486 -0.0000292 -0.0366972 0.009061 0.000015 -0.0000255 0.000021 -0.1807249 -0.1201193 0.014235 0. 0.0504198 0.1100868 0.0000143 -0.000006 0.0000225 -0.1716676 0.0573534 -0.0170543 -0.0000223 -0.1013283 -0.0419741 0.0000236 -0.0000264 0.00001 -0.1688818 0.5660875 -0.3120898 -0.000084 -0.5062815 0.1547759 0.0000633 -0.0000619 0.0000374 0.0367301 0.1520503 0.0099514 0.0000216 -0.0244966 0.2539026 -0.000006 0.0000203 -0.0000172 0.3434736 0.0633278 -0.0393512 0.0000129 -0.0495733 0.058803 -0.0000026 0.0000015 -0.0000108 0.2107235 0.0373071 0.0910399 0.0000184 0.0515579 -0.0042662 -0.0000174 0.0000159 -0.0000182 0.1602754 0.0221606 0.0673638 0.0000187 0.1066462 -0.0528827 -0.0000271 0.0000222 -0.000022 0.1775254 0.0378952 -0.0818321 0.000005 -0.0894911 -0.0830021 -0.0000115 0.0000055 -0.000012 0.1646583 -0.1281477 -0.0197425 0.0000242 -0.0266957 0.0875305 -0.0000037 0.0000239 -0.0000051 0.1638951 unknown
polarizability: 154.8857273|-2.1516908|118.9914638|-0.0079571|0.0041658|42.2845732 unknown
InChI: InChI=1S/C9H6N2/c10-5-7-6-11-9-4-2-1-3-8(7)9/h1-4,6,11H
charge 0 multiplicity 1
17 atoms
N  -0.052549 2.043866 0.000124
N  3.520994 -1.212353 -0.000236
C  -0.023415 -0.24379 -0.000047
C  -0.880305 0.907785 0.000119
C  1.348014 0.252128 -0.000108
C  1.281731 1.654008 -0.000064
C  -0.595983 -1.540722 -0.000101
C  -2.28808 0.802433 0.000236
C  -1.998721 -1.652788 0.000018
C  -2.834792 -0.4957 0.000184
C  2.53549 -0.531051 -0.000261
H  -0.378898 3.008368 0.000252
H  2.093424 2.377776 -0.000116
H  0.042276 -2.430618 -0.000223
H  -2.932999 1.687971 0.000362
H  -2.463829 -2.64425 -0.000015
H  -3.922856 -0.621663 0.000272
