program: Gaussian 09
title: 000230278
version: EM64L-G09RevD.01
frameworkgroup: C1[X(C5H6N2O3)]
method: RPBEPBE
basis: SDD
operation: Freq
keyword: #pfreq=noraman
keyword: PBEPBE/SDD
title: #p freq=noraman PBEPBE/SDD
converged: YES YES NO NO
title: Mulliken charges:
elementType: O O O N N C C C C C H H H H H H
charge: -0.253943 -0.193272 -0.082941 0.109883 0.021926 -0.263806 -0.347437 0.294712 -0.658269 -0.119975 0.234744 0.240166 0.306855 0.226260 0.253775 0.231323
chargesum: 0.00000
title: Mulliken charges with hydrogens summed into heavy atoms:
elementType: O O O N N C C C C C
charge: -0.253943 -0.193272 -0.082941 0.109883 0.021926 0.211104 -0.040582 0.294712 0.053089 -0.119975
polarizability: 1.07627620e+02 8.74709839e-01 7.75534012e+01 3.94500320e+00 2.62747475e+00 5.64729542e+01
1716.lowfreq: -6.1636 -0.0010 -0.0008 -0.0008 2.6836 6.4257 35.5538 53.9769 76.7120
frequency: 35.5222 53.9748 76.7017 91.2642 132.3849 136.9998 204.0828 220.3521 279.4984 326.1344 338.3785 408.3121 455.7995 495.0229 666.5475 680.8447 724.4326 796.1713 813.0080 874.9471 996.3934 1048.2333 1081.5543 1096.0522 1116.3497 1158.5651 1276.1935 1285.8220 1354.5381 1394.9428 1458.1695 1464.1924 1483.9606 1489.8272 1638.2656 2196.1810 2997.2839 3035.5812 3061.6302 3092.9465 3100.2037 3127.1565
redmass: 4.9603 5.3551 5.1397 5.9367 7.1533 5.7062 1.5620 4.7589 2.5839 9.3578 5.7434 6.9405 4.8753 7.7409 12.2883 4.7968 8.2114 2.0594 1.7632 5.2930 2.5001 2.9749 1.2491 2.1579 2.6524 1.6679 1.1201 2.0400 1.2853 1.2251 1.0998 1.0435 1.0661 9.8416 9.4419 12.5213 1.0361 1.0604 1.0840 1.0975 1.1027 1.1067
irintensity: 0.0579 0.1296 1.8559 0.5351 0.2965 3.0605 3.8894 4.1923 14.6107 44.2556 26.9885 11.1546 2.0418 75.7002 37.0295 16.8846 0.2626 2.4721 2.4271 13.8814 6.1062 177.8212 38.6813 43.2451 352.4496 20.6843 2.9966 98.2876 3.5606 24.2132 12.4653 15.3007 17.1077 213.1634 151.3321 6.0158 14.2734 22.2373 2.6861 27.6057 2.0150 25.4980
temp: 298.150 k
press: 1.00000 atm
elementType: 8 8 8 7 7 6 6 6 6 6 1 1 1 1 1 1
symmnumber: 1
zpe: 285694.7 jmol-1
zpe.correction: 0.108815 hartree
zpe.thermalcorrener: 0.120087 hartree
zpe.thermalcorrenthalpy: 0.121031 hartree
zpe.thermalcorrgfe: 0.070263 hartree
zpe.sumelectzpe: -528.438355 hartree
zpe.sumelectthermal: -528.427084 hartree
zpe.sumelectthermalent: -528.426139 hartree
zpe.sumelectthermalfe: -528.476907 hartree
dipole: -4.7089 -2.2205 -2.1274
dipole: 5.6241
quadrupole: -57.1298 -64.3394 -57.7766
quadrupole: -4.1635 -2.7263 -2.3763
quadrupole: 2.6188 -4.5908 1.9720 -4.1635 -2.7263 -2.3763
hfenergy: -528.5471703 hartree
pointgroup: C01 [X(C5H6N2O3)]
dipole: 1.9327847 1.0159771 0.3580651 debye
dipolederiv: -1.6166563 -0.1629531 -0.0893296 -0.3506433 -0.5420419 -0.0106488 -0.3259842 -0.04376 -0.3181801 -0.6538194 0.0799057 -0.0265683 -0.0656114 -0.8714364 -0.0806912 -0.122338 0.0789936 -0.250836 -0.9244103 0.2992128 0.8381803 -0.3616392 0.0950482 0.3203485 0.2584241 -0.1060875 -0.189759 0.9979393 -0.3658411 -1.1357519 0.1761387 -0.1242921 -0.098733 -0.8475119 0.3872358 0.7857498 -0.1626038 0.0155895 -0.1176934 0.0264811 -0.1659725 -0.0355189 0.0304565 0.0351385 -0.201835 0.9306651 -0.030291 0.0118364 -0.2175636 0.2593769 -0.0116895 0.1187898 0.0509434 0.3292281 -0.5275343 0.2261212 0.2598731 0.3664855 0.0588134 -0.2495386 0.4440885 -0.2488191 -0.3617433 1.9592693 -0.0313467 0.0493216 0.3317667 1.199886 0.0509457 0.5027049 -0.0891138 0.1091443 -0.135951 0.0268153 0.0471176 0.0850923 0.0262216 -0.0345466 0.0229881 -0.0784218 -0.087129 -0.0409435 0.0768848 0.2748721 0.0515473 -0.0396174 0.1004083 -0.0021129 0.0005336 -0.0314189 -0.0344243 -0.023295 -0.0332793 -0.030109 -0.0164959 -0.1153747 -0.0539848 -0.0788306 0.0225708 -0.0189422 -0.0445469 0.0609356 0.0501621 -0.0019531 0.1137918 0.0139409 0.0520241 -0.005281 0.1586399 -0.0439885 -0.0472221 -0.0363124 0.0640876 -0.0060635 -0.0331149 -0.0113311 0.0946808 -0.1299839 0.0721735 -0.0545197 0.0897212 0.101264 0.0217213 -0.0391644 0.0311784 0.0744262 0.0792889 -0.0932832 -0.0588819 -0.0776095 0.0053881 -0.0797414 -0.021013 -0.0609774 0.0348066 0.1194666 -0.0011572 0.0211095 -0.0379064 -0.0482765 0.1153306 0.0538313 0.0812942 -0.0044244 unknown
polarizability: 107.9653014|0.2458285|63.8622152|0.1649984|10.561588|69.826459 unknown
InChI: InChI=1S/C5H6N2O3/c1-2-10-5(8)4(3-6)7-9/h4H,2H2,1H3
charge 0 multiplicity 1
16 atoms
O  1.523342 0.642136 0.177718
O  0.53928 -1.478564 -0.005892
O  -2.513715 0.572413 1.34847
N  -1.381017 1.010209 1.11463
N  -2.627488 -0.627115 -1.832564
C  2.832757 0.025047 0.586796
C  -0.770588 0.581641 -0.396293
C  0.481432 -0.233622 -0.078845
C  3.641488 -0.386554 -0.644668
C  -1.754123 -0.095208 -1.217239
H  3.319315 0.829522 1.159473
H  2.618262 -0.837565 1.241522
H  -0.478946 1.57637 -0.776194
H  4.632699 -0.756739 -0.324289
H  3.136866 -1.195896 -1.197933
H  3.797438 0.471227 -1.320791
