program: Gaussian 09
title: 000230273
version: EM64L-G09RevD.01
frameworkgroup: C1[X(C9H11Cl3N4O2)]
method: RPBEPBE
basis: SDD
operation: Freq
keyword: #p
keyword: freq=noraman
keyword: PBEPBE/SDD
title: #p freq=noraman PBEPBE/SDD
converged: YES YES NO NO
title: Mulliken charges:
elementType: Cl Cl Cl O O N N N N C C C C C C C C C H H H H H H H H H H H
charge: -0.039925 -0.030446 0.030277 -0.175844 -0.203324 -0.130648 0.017004 -0.004069 0.046938 -0.326317 -0.397446 0.261535 0.101204 -0.595574 -0.590169 0.184161 -0.750645 -0.404606 0.239705 0.285872 0.275889 0.264939 0.310500 0.266428 0.266012 0.323965 0.243901 0.262144 0.268538
chargesum: 0.00000
title: Mulliken charges with hydrogens summed into heavy atoms:
elementType: Cl Cl Cl O O N N N N C C C C C C C C C
charge: -0.039925 -0.030446 0.030277 -0.175844 -0.203324 -0.130648 0.017004 -0.004069 0.046938 0.199260 0.143382 0.261535 0.101204 -0.018646 -0.000192 0.184161 0.023938 -0.404606
polarizability: 2.23373570e+02 -9.02820965e+00 2.10605125e+02 1.44886996e+00 -4.72537476e+00 9.46956646e+01
1716.lowfreq: -4.4912 -0.0028 -0.0021 0.0008 3.9792 7.0633 24.2237 39.7270 41.7625
frequency: 24.1748 39.7121 41.7456 44.8405 66.8732 84.3703 97.5821 139.3284 145.3224 168.3071 170.6271 180.9415 199.4866 209.1720 224.5746 237.2937 250.9156 278.7494 308.7265 361.7900 406.0072 423.6459 449.8841 506.1075 534.9044 560.4165 584.4820 619.6740 654.2843 690.7209 700.0705 708.0787 747.3101 772.8845 784.2121 787.3807 845.4522 895.9562 969.8680 1003.4652 1015.7678 1041.7840 1043.7243 1054.5069 1058.7182 1089.5183 1117.0591 1180.9932 1206.1744 1213.5631 1254.7722 1260.3087 1263.9215 1273.9689 1290.5086 1308.9878 1341.6870 1356.2616 1362.7733 1368.7062 1400.6266 1432.5627 1444.4510 1455.9989 1457.8839 1459.3995 1474.1689 1484.4748 1495.5386 1539.9594 3004.2758 3010.5895 3038.1182 3067.1151 3070.0696 3084.4151 3103.2955 3113.0478 3138.3360 3160.4242 3164.4423
redmass: 16.9648 17.7017 6.6050 11.2812 7.9004 8.2589 2.4565 1.0847 4.6301 3.4670 10.0379 7.2590 6.3150 8.4351 5.0617 8.8892 3.6433 3.8368 11.7980 4.1598 3.6967 5.0850 7.5997 6.9082 6.2645 4.6886 5.4545 6.7311 11.0470 10.5660 5.4896 6.2705 8.1967 5.6238 1.2533 1.1893 6.9007 6.1252 2.2982 1.5660 1.9779 3.2303 1.6452 3.4777 3.6828 1.9422 2.0150 3.4824 3.2157 1.8401 3.6980 1.6655 1.6101 1.6272 1.1914 1.4128 7.6135 1.2685 1.5662 4.0349 1.2318 1.8074 1.5917 1.1279 1.0816 1.1408 1.6710 2.3652 1.2510 3.7579 1.0383 1.0692 1.0592 1.0589 1.0576 1.0958 1.1042 1.0944 1.1004 1.1112 1.1098
irintensity: 0.0260 0.7944 1.5615 0.2522 2.2069 2.9842 1.5615 1.7873 1.1235 2.0789 2.2997 2.3213 1.1036 3.3956 2.6698 7.6788 1.3994 3.2531 2.6298 14.4650 7.7565 5.7329 10.9715 6.8475 9.7327 4.5134 3.4142 7.3604 2.4545 12.0887 47.5804 38.8364 7.5993 7.1833 5.7562 14.3713 64.9147 39.6136 27.7732 4.2000 30.4329 8.3956 6.4915 5.2253 3.5001 51.8493 50.8666 280.8446 140.1501 30.3721 55.5590 19.9698 2.9784 5.8761 4.6650 6.1055 119.8033 1.2454 46.5003 35.5607 37.3152 248.5863 6.9771 20.6962 10.1110 21.4583 29.9013 132.1814 162.2286 711.0415 0.7774 13.3940 14.8038 15.0341 14.1506 4.6934 3.4345 6.4860 7.3798 6.3580 4.0388
temp: 298.150 k
press: 1.00000 atm
elementType: 17 17 17 8 8 7 7 7 7 6 6 6 6 6 6 6 6 6 1 1 1 1 1 1 1 1 1 1 1
symmnumber: 1
zpe: 536060.0 jmol-1
zpe.correction: 0.204174 hartree
zpe.thermalcorrener: 0.222922 hartree
zpe.thermalcorrenthalpy: 0.223866 hartree
zpe.thermalcorrgfe: 0.154212 hartree
zpe.sumelectzpe: -2097.736748 hartree
zpe.sumelectthermal: -2097.718000 hartree
zpe.sumelectthermalent: -2097.717056 hartree
zpe.sumelectthermalfe: -2097.786710 hartree
dipole: 0.0728 -0.2791 -0.7050
dipole: 0.7618
quadrupole: -142.5430 -142.3445 -124.3553
quadrupole: 11.9081 -2.8893 0.0097
quadrupole: -6.1287 -5.9302 12.0590 11.9081 -2.8893 0.0097
hfenergy: -2097.9409224 hartree
pointgroup: C01 [X(C9H11Cl3N4O2)]
dipole: -0.025937 0.2842016 0.0915233 debye
polarizability: 209.4546848|0.1390615|139.5083545|-10.1123929|-61.6232463|179.7113198 unknown
InChI: InChI=1S/C9H11Cl3N4O2/c1-6-7(16(17)18)8(14-9(12)13-6)15(4-2-10)5-3-11/h2-5H2,1H3
charge 0 multiplicity 1
29 atoms
Cl 4.003935 -2.294935 1.902588
Cl 3.151556 2.502735 -2.621967
Cl -1.830554 -2.067777 3.481142
O  -1.804665 1.909879 -1.96239
O  -0.347201 0.209547 -2.419134
N  1.207927 0.338187 0.330008
N  -0.331345 -0.790492 1.668845
N  -1.120413 0.870758 -1.613175
N  -2.733456 -0.598382 1.420738
C  2.25802 -0.246601 1.216635
C  1.649843 1.461168 -0.535458
C  -0.106047 -0.022216 0.545559
C  -1.253272 0.359376 -0.246425
C  2.558006 -1.708305 0.847865
C  2.49523 0.981495 -1.728867
C  -2.564398 0.098544 0.249615
C  -3.826202 0.502886 -0.46894
C  -1.599934 -1.029747 2.017254
H  3.169907 0.36213 1.096888
H  1.932619 -0.195848 2.268289
H  0.789908 2.046095 -0.892932
H  2.257928 2.146546 0.085665
H  1.716996 -2.371804 1.088192
H  2.876098 -1.82734 -0.198225
H  3.38608 0.418469 -1.413316
H  1.901634 0.420759 -2.4613
H  -3.822499 0.184205 -1.526744
H  -4.681868 0.04721 0.04912
H  -3.938533 1.600758 -0.475331
