program: Gaussian 09
title: 000230271
version: EM64L-G09RevD.01
frameworkgroup: C1[X(C8H7Cl5N2)]
method: RPBEPBE
basis: SDD
operation: Freq
keyword: #p
keyword: freq=noraman
keyword: PBEPBE/SDD
title: #p freq=noraman PBEPBE/SDD
converged: YES YES NO NO
title: Mulliken charges:
elementType: Cl Cl Cl Cl Cl N N C C C C C C C C H H H H H H H
charge: -0.006116 0.010498 0.044050 0.046042 0.047918 -0.448722 -0.560085 -0.319090 0.875849 -0.445136 -0.395895 -0.336927 -0.054547 -0.075196 -0.157629 0.228137 0.228411 0.315035 0.221999 0.221850 0.279763 0.279791
chargesum: 0.00000
title: Mulliken charges with hydrogens summed into heavy atoms:
elementType: Cl Cl Cl Cl Cl N N C C C C C C C C
charge: -0.006116 0.010498 0.044050 0.046042 0.047918 -0.133687 -0.000530 0.137458 0.875849 -0.001287 -0.395895 -0.336927 -0.054547 -0.075196 -0.157629
polarizability: 2.23041843e+02 2.24251364e+00 1.82545375e+02 2.30762857e-01 -1.83673865e-02 6.63348971e+01
1716.lowfreq: -20.9795 -0.0030 -0.0028 -0.0017 3.5304 4.6745 8.3311 61.6818 66.1503
frequency: -20.5569 61.6780 66.1345 79.3399 81.8637 99.1944 136.2890 161.6372 200.6143 204.8341 216.1008 224.7228 246.0723 261.3965 263.5173 306.4884 312.6158 315.6309 324.0389 352.6169 421.7258 492.6108 499.0410 507.7891 562.4779 612.6506 620.0502 667.3956 728.4058 756.4637 779.0937 804.7823 918.2057 967.6295 1021.6204 1052.5414 1112.7877 1124.0237 1161.9357 1260.4897 1275.0380 1276.8210 1321.1959 1331.1202 1359.3678 1369.0214 1436.9773 1467.1028 1485.5642 1488.3075 1553.3713 1580.4995 1642.4390 2975.2024 2992.4915 3026.6444 3060.0539 3487.0747 3497.2805 3627.3314
redmass: 7.5271 23.9461 3.9151 2.9715 5.7305 4.4151 2.8275 8.9550 15.6604 27.3238 24.4276 19.9721 6.4646 5.1560 1.0545 26.3660 8.3024 11.2716 24.9654 29.1699 2.3710 1.8389 1.2410 8.8487 11.0676 13.5220 11.1124 8.6056 11.2961 11.5291 1.1067 12.6170 9.5088 1.1532 5.7595 7.2096 7.7369 4.3210 1.3015 3.3576 1.2352 5.9542 1.6837 1.1457 1.3214 11.8331 4.2043 1.0905 1.7636 1.8140 1.8802 6.6976 1.0917 1.0596 1.0577 1.1036 1.1078 1.0746 1.0446 1.0998
irintensity: 0.0904 0.0689 0.5305 2.3656 1.0304 3.3487 2.4850 1.2022 0.3375 0.3877 0.2227 1.2389 8.9929 6.5632 40.0132 0.4786 2.9054 0.0550 1.8112 0.5751 70.3773 331.7515 82.7078 49.0610 0.5148 34.0287 6.4052 20.4900 81.2977 9.0821 1.7100 0.8857 14.2186 0.9368 1.6044 51.5604 17.4770 28.8432 0.0178 63.8775 0.5015 64.1903 55.9101 0.0055 7.7075 25.6960 154.9414 8.5849 142.0251 36.3355 13.9568 286.8721 39.8846 20.8597 60.9316 4.6742 58.3297 55.6104 4.9754 4.0433
temp: 298.150 k
press: 1.00000 atm
elementType: 17 17 17 17 17 7 7 6 6 6 6 6 6 6 6 1 1 1 1 1 1 1
symmnumber: 1
zpe: 366293.0 jmol-1
zpe.correction: 0.139514 hartree
zpe.thermalcorrener: 0.155357 hartree
zpe.thermalcorrenthalpy: 0.156301 hartree
zpe.thermalcorrgfe: 0.095173 hartree
zpe.sumelectzpe: -2717.698914 hartree
zpe.sumelectthermal: -2717.683070 hartree
zpe.sumelectthermalent: -2717.682126 hartree
zpe.sumelectthermalfe: -2717.743255 hartree
dipole: -4.0590 -0.1901 0.0089
dipole: 4.0635
quadrupole: -118.8084 -125.2573 -121.0674
quadrupole: 5.8580 -0.0246 -0.0355
quadrupole: 2.9026 -3.5463 0.6437 5.8580 -0.0246 -0.0355
hfenergy: -2717.8384274 hartree
pointgroup: C01 [X(C8H7Cl5N2)]
dipole: -1.59669 -0.061328 0.0515671 debye
dipolederiv: -0.1785007 0.2112477 -0.0018784 0.1613695 -0.6050012 0.0136919 0.000028 0.0121977 -0.0113536 -0.3107625 -0.2868323 0.0156065 -0.25739 -0.4465961 0.0184687 0.0150907 0.0184153 -0.006461 -0.1048262 0.2061224 -0.0030597 0.2396354 -0.5728682 0.0104014 -0.0038955 0.0113752 0.0016882 -0.2951159 -0.2989933 0.0171485 -0.3528564 -0.4034592 0.0217862 0.0184201 0.0204374 0.0030658 -0.6935618 0.0955297 0.015519 0.1088478 -0.0284534 -0.0016066 0.01447 -0.0008407 0.0122739 -1.85902 0.1258822 0.0368961 0.4042823 -0.2619663 -0.0183778 0.0226018 -0.00777 -0.4389066 -1.2165567 0.1634516 0.0290964 0.2654532 -0.5291827 0.0031109 0.0272129 0.0063058 -0.1915576 0.5479419 0.1090524 -0.0101316 0.5366102 0.1826121 -0.0119803 -0.0232345 0.0004304 0.3287935 1.5630768 -0.2900622 -0.028299 -0.5984215 -0.2511839 0.0322549 -0.0162769 0.0227713 0.2288003 0.8085005 0.0071173 -0.0198295 -0.0626339 0.3372666 -0.0027675 -0.0179792 -0.0044973 0.22573 -0.4292602 -0.0851266 0.0115957 -0.6290699 0.7393701 -0.0097698 0.0288907 -0.0248144 -0.1350488 -0.0341937 0.2819011 -0.008638 0.9389807 0.4375667 -0.0401961 -0.0299808 -0.0216042 -0.1483319 0.2606214 -0.091137 -0.0047228 -0.3922187 0.850932 -0.0143179 0.0037637 -0.022286 0.0187199 0.4630992 0.2238591 -0.0193827 0.5204363 0.6752472 -0.033358 -0.0277522 -0.025744 0.0248698 0.6419807 -0.2036838 -0.0122754 -0.2030664 -0.5649537 0.0188732 -0.0117322 0.0185228 -0.0979407 -0.047794 0.0059886 -0.0068569 -0.1157833 -0.0132885 0.0852834 0.0412795 0.0932289 -0.0789673 -0.0483893 -0.0007106 0.0039378 -0.1251283 -0.0252918 -0.08122 -0.0340945 -0.0965379 -0.0638378 0.2328598 0.026085 0.0006189 -0.0564468 0.1870571 0.004756 0.0028949 0.0014889 0.2700527 0.0231377 -0.033207 0.0264502 0.0139589 -0.0149485 0.1044799 0.0318519 0.1309658 -0.0801975 0.0185492 -0.0449745 -0.0301969 0.0036908 -0.0320691 -0.108336 -0.03905 -0.1313682 -0.0584854 0.3249752 -0.0606966 -0.0782268 -0.1974576 0.176515 0.1258478 -0.0478821 0.0730112 0.0956689 0.3332385 -0.0608133 0.0666285 -0.2027922 0.1626959 -0.1170245 0.0453737 -0.0736879 0.1014254 unknown
polarizability: 222.9552298|1.8102037|182.4106774|-4.3601642|-3.461722|66.5562084 unknown
InChI: InChI=1S/C8H7Cl5N2/c9-3-4(10)6(12)8(15-2-1-14)7(13)5(3)11/h15H,1-2,14H2
charge 0 multiplicity 1
22 atoms
Cl -0.017361 2.958877 -0.090825
Cl -0.867853 -2.599884 0.090859
Cl 2.248794 -3.040564 0.02747
Cl 3.134707 2.436361 -0.15848
Cl 4.29467 -0.56997 -0.096485
N  -1.690006 0.520989 0.027339
N  -5.439908 -0.047905 0.179911
C  -2.914031 -0.301924 0.097994
C  -0.348759 0.183101 0.0018
C  -4.1526 0.643491 0.108682
C  0.617617 1.250158 -0.055947
C  0.210307 -1.136581 0.02514
C  1.606427 -1.35731 -0.004354
C  2.004338 1.037205 -0.0862
C  2.518945 -0.280058 -0.059757
H  -2.926406 -0.922057 1.013517
H  -2.988204 -0.983273 -0.769742
H  -1.858012 1.530867 -0.001779
H  -4.136733 1.270485 -0.804809
H  -4.072747 1.334485 0.971293
H  -5.647142 -0.523034 1.060195
H  -5.709042 -0.584057 -0.646926
