program: Gaussian 09
title: 000230266
version: EM64L-G09RevD.01
frameworkgroup: C1[X(C11H13Cl2NOS2)]
method: RPBEPBE
basis: SDD
operation: Freq
keyword: #p
keyword: freq=noraman
keyword: PBEPBE/SDD
title: #p freq=noraman PBEPBE/SDD
converged: YES YES NO NO
title: Mulliken charges:
elementType: Cl Cl S S O N C C C C C C C C C C C H H H H H H H H H H H H H
charge: -0.021829 -0.055902 0.218435 -0.011758 -0.241097 -0.003745 -0.224274 -0.687889 0.491448 -0.435774 -0.294463 -0.313005 -0.600676 -0.614986 -0.198504 -0.224176 -0.105719 0.256738 0.223561 0.280310 0.284155 0.261869 0.263822 0.266295 0.204824 0.221431 0.264442 0.259530 0.280352 0.256584
chargesum: 0.00000
title: Mulliken charges with hydrogens summed into heavy atoms:
elementType: Cl Cl S S O N C C C C C C C C C C C
charge: -0.021829 -0.055902 0.218435 -0.011758 -0.241097 -0.003745 0.256024 -0.123424 0.491448 -0.435774 -0.294463 -0.051136 0.134265 0.130417 0.081848 0.032408 -0.105719
polarizability: 2.29620319e+02 5.72541633e+00 1.91704542e+02 -1.53638242e+00 1.39474228e+01 1.36553919e+02
1716.lowfreq: -12.7702 -1.7207 -0.0019 0.0018 0.0023 3.2621 14.1757 19.2878 24.5925
frequency: 13.3066 18.6546 24.4551 45.7453 63.3417 78.8422 84.3631 100.0598 124.2505 144.8955 163.2252 174.1155 188.7725 227.0763 240.1500 274.1161 295.9433 318.7813 329.8627 364.5492 381.4066 384.5120 432.8311 440.2007 465.2747 514.5289 535.0046 547.3473 552.0134 634.0126 638.9792 689.6511 701.2472 776.4885 801.5631 842.4277 863.4907 869.0829 926.3542 946.9534 966.5878 993.8574 1030.8329 1044.2659 1083.4913 1087.5573 1090.7302 1120.1617 1138.8799 1148.8252 1181.7277 1231.6082 1247.5118 1249.8086 1256.1031 1303.2815 1354.6469 1365.1985 1373.1919 1390.9036 1396.5833 1423.5638 1442.6857 1457.5178 1464.3676 1467.3799 1474.5042 1474.9343 1501.9844 1569.2274 1595.8987 2960.5154 2979.3903 2990.1230 3023.3396 3042.0299 3059.3179 3073.7872 3111.5120 3112.2142 3124.3912 3162.6333 3181.1123 3183.6802
redmass: 5.4600 8.6607 6.2593 5.1064 1.5363 1.9781 2.4133 4.2309 2.0735 7.3726 5.9404 6.5506 5.4114 3.5950 3.1701 6.6675 4.4196 3.5869 7.4161 5.0453 7.0485 5.3738 3.7742 3.2791 4.1382 5.6418 9.0588 4.0772 4.0795 6.1749 5.6667 5.1658 3.7458 4.5068 1.4890 4.8784 1.3869 3.1900 1.3482 4.8879 2.7367 2.0014 3.9833 1.6152 2.2792 2.7218 1.2362 1.3537 1.6638 1.3233 1.0978 2.0654 3.4489 1.4516 1.4820 1.2477 2.5096 1.8952 2.6810 4.7908 1.1225 1.1259 1.0416 1.6986 1.2072 1.0622 1.4054 1.0614 1.2713 7.7387 7.5546 1.0590 1.0350 1.0343 1.0627 1.1013 1.1012 1.1012 1.1020 1.1036 1.0986 1.0878 1.0956 1.0944
irintensity: 1.0784 0.8327 2.9366 0.8142 1.0171 0.1795 1.8214 1.0590 0.0339 4.3932 1.0694 2.0453 3.2006 2.1046 6.7360 2.5607 3.4250 7.8979 0.8199 0.9762 8.6247 11.4805 4.6353 6.3278 2.6035 0.1291 0.0689 7.5495 6.0661 18.9132 14.0338 47.3224 0.5406 40.4310 53.3378 20.1216 21.4281 3.3250 0.6451 152.7571 13.5931 18.9674 81.1129 15.8350 6.3599 44.7381 0.1616 3.0179 27.0629 3.7250 12.7552 137.1346 27.4426 82.1801 91.8285 4.2598 8.6203 20.8521 138.8376 1.1952 27.5497 10.7387 5.1398 248.1936 16.0477 21.3616 47.3500 4.0981 180.1153 20.4702 11.2692 24.9230 24.0259 42.9485 9.4616 26.2063 14.2593 20.1825 4.2445 0.8701 36.1569 5.5760 1.4351 1.8113
temp: 298.150 k
press: 1.00000 atm
elementType: 17 17 16 16 8 7 6 6 6 6 6 6 6 6 6 6 6 1 1 1 1 1 1 1 1 1 1 1 1 1
symmnumber: 1
zpe: 575103.2 jmol-1
zpe.correction: 0.219045 hartree
zpe.thermalcorrener: 0.238350 hartree
zpe.thermalcorrenthalpy: 0.239295 hartree
zpe.thermalcorrgfe: 0.166628 hartree
zpe.sumelectzpe: -2271.892012 hartree
zpe.sumelectthermal: -2271.872707 hartree
zpe.sumelectthermalent: -2271.871763 hartree
zpe.sumelectthermalfe: -2271.944429 hartree
dipole: 3.8960 -0.2210 1.4196
dipole: 4.1524
quadrupole: -125.6802 -131.5779 -121.0463
quadrupole: 6.3989 16.8970 1.8611
quadrupole: 0.4213 -5.4764 5.0551 6.3989 16.8970 1.8611
hfenergy: -2272.1110572 hartree
pointgroup: C01 [X(C11H13Cl2N1O1S2)]
dipole: -1.5557992 -0.3576277 0.347206 debye
polarizability: 228.2552962|2.3319699|180.1160024|10.5887303|26.9497489|149.507482 unknown
InChI: InChI=1S/C11H13Cl2NOS2/c1-14(2)11(16)17-6-5-15-10-4-3-8(12)7-9(10)13/h3-4,7H,5-6H2,1-2H3
charge 0 multiplicity 1
30 atoms
Cl 2.643754 -2.154258 -1.899651
Cl 5.875297 0.338405 1.866987
S  -2.332697 -0.826675 -1.483123
S  -3.596612 1.626702 0.047044
O  0.781924 0.087423 -1.362277
N  -4.290909 -0.988769 0.370723
C  -0.26714 1.114659 -1.210977
C  -1.429932 0.701445 -2.102073
C  1.929042 0.211975 -0.584528
C  -3.50654 -0.056573 -0.258007
C  2.92119 -0.795684 -0.732314
C  2.1750 1.26598 0.33318
C  -5.287115 -0.527653 1.365292
C  -4.194522 -2.434489 0.059938
C  4.117501 -0.768092 0.003913
C  3.372324 1.310268 1.081656
C  4.326049 0.293448 0.907883
H  -0.59292 1.19364 -0.156487
H  0.130695 2.096383 -1.54415
H  -1.085867 0.435462 -3.114613
H  -2.176798 1.513372 -2.140936
H  1.436553 2.059784 0.473453
H  -6.039097 0.126249 0.888052
H  -4.792107 0.062957 2.155913
H  -5.783179 -1.405554 1.807686
H  -4.875001 -2.990285 0.721449
H  -3.164773 -2.803042 0.220491
H  -4.475423 -2.636072 -0.990673
H  4.863806 -1.55539 -0.12695
H  3.551799 2.126688 1.7863
