program: Gaussian 09
title: 000230262
version: EM64L-G09RevD.01
frameworkgroup: C1[X(C10H11Cl2NS2)]
method: RPBEPBE
basis: SDD
operation: Freq
keyword: #p
keyword: freq=noraman
keyword: PBEPBE/SDD
title: #p freq=noraman PBEPBE/SDD
converged: YES YES NO NO
title: Mulliken charges:
elementType: Cl Cl S S N C C C C C C C C C C H H H H H H H H H H H
charge: -0.014110 -0.005792 0.182887 0.013355 -0.003637 0.513276 -0.800443 -0.353689 -0.381227 -0.432717 -0.059858 -0.194426 -0.102819 -0.602875 -0.617858 0.303875 0.302474 0.269496 0.249885 0.260235 0.265361 0.264742 0.202708 0.221830 0.259001 0.260326
chargesum: 0.00000
title: Mulliken charges with hydrogens summed into heavy atoms:
elementType: Cl Cl S S N C C C C C C C C C C
charge: -0.014110 -0.005792 0.182887 0.013355 -0.003637 0.513276 -0.194094 -0.084194 -0.131342 -0.432717 -0.059858 0.065809 -0.102819 0.129937 0.123299
polarizability: 2.70883292e+02 -4.68672978e+00 1.35704584e+02 -1.14229670e+01 2.26389559e+00 1.30123660e+02
1716.lowfreq: -7.9680 -5.1980 -3.0927 0.0011 0.0015 0.0016 7.7174 15.9890 36.8703
frequency: -6.5856 15.8334 36.8631 42.9191 51.9388 67.3250 106.1765 116.6783 131.7334 173.9414 186.6119 234.6068 237.3551 240.0297 296.8642 325.5368 354.9302 398.2273 426.3256 432.7049 437.8619 447.2239 534.0454 548.4067 559.6136 632.9655 666.7051 673.3859 718.8051 827.7352 841.9299 855.4683 891.4847 898.5003 954.9648 957.7432 1003.3373 1045.3554 1091.5673 1107.3523 1118.7384 1120.2588 1140.4159 1146.8404 1213.9310 1240.7318 1250.8894 1259.7886 1369.5571 1371.6083 1383.7592 1424.0013 1440.8218 1440.9745 1460.1662 1464.4362 1466.6743 1474.8475 1501.8517 1568.9250 1595.3530 2976.1804 2989.2476 3045.9607 3053.8533 3071.5069 3112.0800 3121.2322 3123.3048 3146.8146 3158.2661 3173.7479
redmass: 6.1679 6.2614 7.0207 1.3230 1.2458 4.0117 7.1188 2.1017 9.7518 6.4582 19.1451 3.3609 3.3889 5.0216 6.4830 7.1555 5.8674 6.2023 4.2724 5.2002 3.6329 5.3020 9.2028 5.4632 4.7226 6.4854 6.2956 6.9740 3.1208 1.4175 4.9567 3.7420 1.5371 1.7254 5.3061 1.3595 5.3407 1.6156 1.2330 1.2089 1.4569 1.7286 1.6923 1.3201 1.9396 1.2984 3.8154 1.6514 6.8074 3.0765 3.0542 1.1287 1.0412 1.1077 2.7862 1.2190 1.0437 1.0607 1.2493 7.7752 6.7235 1.0354 1.0341 1.0580 1.1013 1.1013 1.1012 1.1083 1.0983 1.0896 1.0927 1.0965
irintensity: 0.1300 1.3788 0.7198 0.0084 0.0104 6.2365 1.4476 0.0379 2.0261 0.0201 0.0894 6.1792 0.4856 2.1909 2.1083 1.4519 0.8684 8.4716 12.9091 3.0794 17.3852 25.8352 0.0298 4.7525 14.1399 1.7445 8.4608 22.8122 12.6966 26.7812 34.9445 19.3625 14.7468 15.8380 203.3250 0.2925 30.8394 15.8496 0.0278 3.4426 7.8043 30.7970 22.3494 2.5266 14.9456 25.4563 48.4997 9.1343 6.3620 122.8521 20.0196 9.4810 5.9193 14.7541 76.2854 7.7219 24.8890 5.1085 191.3368 16.1689 2.6258 26.7231 45.2351 3.7407 15.7369 19.5996 4.0973 1.7321 42.2783 4.8921 1.2160 2.5840
temp: 298.150 k
press: 1.00000 atm
elementType: 17 17 16 16 7 6 6 6 6 6 6 6 6 6 6 1 1 1 1 1 1 1 1 1 1 1
symmnumber: 1
zpe: 490455.9 jmol-1
zpe.correction: 0.186805 hartree
zpe.thermalcorrener: 0.203085 hartree
zpe.thermalcorrenthalpy: 0.204030 hartree
zpe.thermalcorrgfe: 0.139262 hartree
zpe.sumelectzpe: -2157.539677 hartree
zpe.sumelectthermal: -2157.523396 hartree
zpe.sumelectthermalent: -2157.522452 hartree
zpe.sumelectthermalfe: -2157.587220 hartree
dipole: 3.7567 0.1906 2.9188
dipole: 4.7611
quadrupole: -113.3968 -113.2950 -117.7133
quadrupole: 12.3100 14.4656 -1.4812
quadrupole: 1.4049 1.5067 -2.9116 12.3100 14.4656 -1.4812
hfenergy: -2157.7264814 hartree
pointgroup: C01[X(C10H11Cl2N1S2)]
dipole: 1.514107 0.4294621 1.0157762 debye
dipolederiv: -0.3402068 0.2499351 -0.1465785 0.3434001 -0.3682085 0.209196 -0.1966542 0.2099105 -0.172447 -0.788751 -0.0044036 0.2147642 0.0133484 -0.0507667 0.0131381 0.2565207 0.0184643 -0.1204468 -1.0804114 0.069328 0.2204959 0.1976696 -0.0999689 -0.0561578 0.3810484 -0.040057 -0.1652452 -0.5137179 0.0696884 0.1142896 0.1222736 -0.4938937 -0.3327476 0.187571 -0.322711 -0.5692249 -1.1470418 -0.3392105 -0.221649 -0.3040405 -0.5802286 -0.382914 -0.1763468 -0.369087 -0.549947 0.288709 0.0242323 -0.0283041 -0.0069229 0.0017613 -0.0580178 -0.0301476 -0.0698982 -0.0226292 0.5453601 0.0667192 0.0124146 0.2564195 0.1135179 0.0012499 0.1560636 0.033651 0.1039484 -0.2083446 0.1127162 -0.0942533 0.0653566 -0.1371862 0.0274603 -0.0308136 0.0122974 -0.0771461 -0.0883883 -0.0682378 0.0059798 -0.0208503 -0.0341858 -0.078511 -0.005574 -0.0724729 -0.0632779 1.5780369 0.2069105 -0.0260813 -0.1194573 0.5485177 0.7407454 -0.3790135 0.6866826 0.6574122 0.2452296 -0.4747698 0.3415136 -0.5074023 0.5089444 -0.356098 0.3511154 -0.3120582 0.1705922 -0.2423255 -0.0158983 0.0511402 0.0623246 -0.0242085 -0.0632625 -0.0062685 -0.046658 -0.0392262 0.9938328 0.102179 -0.4294649 0.0186271 -0.0970338 0.0373698 -0.3871258 -0.0020276 0.0587379 0.4481327 0.0590738 0.0266182 -0.0582072 0.1623983 -0.0148049 -0.1049562 -0.0323778 0.1642698 0.0204627 -0.0788607 -0.0587792 0.0281212 0.2827695 0.0798315 0.056305 0.09621 0.304007 0.0172199 0.0158773 -0.0055979 -0.0477112 -0.0324545 0.0030738 -0.0948827 -0.0109512 0.0550047 0.0000296 -0.0094195 -0.0043785 -0.0942643 0.0391721 0.0184816 -0.0575461 0.0084669 -0.0353166 0.0909581 -0.0197467 0.0545262 -0.0276293 0.0728118 0.0654511 0.061976 0.068008 0.0644399 0.0246536 0.0937718 -0.0261174 0.0954122 0.0455607 0.0619766 -0.0287772 0.0558972 0.0936715 0.0593993 -0.0180196 0.0454321 -0.0131388 0.0689705 0.0861113 0.0555577 0.0888152 0.0673036 0.0282909 -0.0054538 -0.0254533 0.037004 0.0776657 0.0293061 0.0996503 0.0756339 -0.0712186 0.01709 -0.0069198 -0.0078799 0.1200785 -0.063475 0.0519734 0.0457721 0.0300646 0.0778577 -0.0056489 -0.0594114 -0.0442229 -0.1458136 0.0081209 -0.0972784 -0.1350617 -0.1094464 0.0247137 -0.1192942 -0.1272321 -0.0950868 -0.0563948 0.0726381 -0.046776 -0.0198856 -0.0357421 0.0907829 0.1090056 0.009205 0.1225283 -0.0469957 0.000946 0.0626686 0.0631287 0.0096806 -0.0585864 0.0677195 0.147947 0.0041443 0.0887927 -0.0221847 -0.0014655 -0.0616553 0.0297052 0.0119705 unknown
polarizability: 270.0808339|-5.7581014|136.2864712|-15.278855|0.407909|130.3442317 unknown
InChI: InChI=1S/C10H11Cl2NS2/c1-13(2)10(14)15-6-7-3-4-8(11)9(12)5-7/h3-5H,6H2,1-2H3
charge 0 multiplicity 1
26 atoms
Cl -4.297654 1.816368 -1.471342
Cl -5.461204 -0.257741 0.806353
S  1.467167 0.555676 0.084398
S  3.449793 -0.953202 -1.82937
N  4.147083 0.907382 0.039134
C  -1.02747 -0.500403 -0.569645
C  0.410939 -0.590807 -1.017033
C  -1.891948 0.473141 -1.129775
C  -1.540993 -1.3859 0.412466
C  3.163653 0.178353 -0.581383
C  -3.236926 0.554835 -0.718454
C  -2.887022 -1.305305 0.823857
C  -3.737811 -0.332701 0.257666
C  5.552113 0.707324 -0.384133
C  3.842335 1.880806 1.112735
H  0.837813 -1.599671 -0.908307
H  0.568345 -0.25756 -2.054104
H  -1.520943 1.170871 -1.887115
H  -0.886269 -2.142321 0.857936
H  -3.284831 -1.989933 1.578285
H  5.667779 0.937292 -1.458274
H  5.85228 -0.345812 -0.239384
H  6.201949 1.366795 0.212099
H  4.778186 2.350613 1.449339
H  3.36533 1.382759 1.977605
H  3.160304 2.671738 0.748644
