program: Gaussian 09
title: 000021780
version: EM64L-G09RevD.01
frameworkgroup: C1[X(C12H13N3O)]
method: RPBEPBE
basis: SDD
operation: Freq
keyword: #p
keyword: freq=noraman
keyword: PBEPBE/SDD
title: #p freq=noraman PBEPBE/SDD
converged: YES YES NO NO
title: Mulliken charges:
elementType: O N N N C C C C C C C C C C C C H H H H H H H H H H H H H
charge: -0.216381 -0.221760 -0.417140 0.001701 0.391778 0.390769 -0.410189 -0.409565 -0.792138 -0.789008 0.178365 0.311921 -0.287346 -0.315869 -0.323251 -0.328175 0.246387 0.246488 0.322804 0.245135 0.251316 0.216349 0.215239 0.249896 0.244396 0.273219 0.228934 0.249712 0.246416
chargesum: 0.00000
title: Mulliken charges with hydrogens summed into heavy atoms:
elementType: O N N N C C C C C C C C C C C C
charge: -0.216381 -0.221760 -0.094336 0.001701 0.391778 0.390769 -0.163802 -0.163078 -0.079339 -0.079477 0.178365 0.311921 -0.014127 -0.086935 -0.073539 -0.081760
polarizability: 2.05173030e+02 1.74111052e+00 1.32228701e+02 5.93798689e+00 -1.16748875e+01 1.09378505e+02
1716.lowfreq: -8.5229 -0.0007 -0.0005 -0.0002 5.1902 8.7091 23.1093 36.7513 50.5458
frequency: 22.5345 36.6758 50.5099 62.8729 119.1388 129.5474 141.9752 153.0632 170.6847 234.3957 279.0461 295.9238 302.8739 315.8395 364.1947 399.6765 480.5552 501.0662 516.1499 577.6271 597.5654 618.9089 649.3381 659.5869 694.2021 720.1934 753.9206 768.5624 773.6095 837.6003 838.8238 877.5742 891.6414 957.9017 959.9498 966.4608 969.0128 987.7197 1030.1224 1035.0552 1041.3799 1048.2444 1059.2328 1076.3911 1093.2595 1215.7573 1219.0964 1222.2728 1251.5762 1299.5692 1317.7943 1326.2281 1354.2211 1398.9024 1401.4816 1404.8140 1406.7125 1455.1202 1464.3019 1465.0531 1473.4672 1474.5051 1479.1236 1548.2893 1551.4465 1580.5533 1593.9079 1622.5330 2964.9424 2966.5133 3035.4923 3036.1660 3096.0940 3096.6594 3129.6214 3143.0451 3152.4962 3173.8755 3204.1251 3223.7289 3509.3945
redmass: 3.9942 4.6151 4.9967 4.6132 2.4603 1.1570 1.8668 1.7179 5.1842 3.3236 3.2003 3.8714 4.8506 5.8354 2.4759 5.6945 3.1641 1.6804 2.4115 4.4396 4.7525 3.1045 6.5516 6.8454 4.1489 4.8047 2.9376 1.2212 4.7998 1.4973 1.5182 6.2502 1.2655 3.8581 2.2028 1.6747 1.6795 1.4468 1.2602 2.1835 1.4242 1.4570 2.5669 2.1452 2.0037 2.1785 1.3984 1.9374 3.1737 7.0590 3.2436 1.5217 7.3545 1.8380 1.2367 1.5859 2.5170 1.6503 1.0535 1.1134 1.2137 1.2888 1.3194 7.1993 5.9943 5.5765 5.8863 8.7268 1.0394 1.0392 1.0978 1.0977 1.0958 1.0956 1.0876 1.0897 1.0974 1.0969 1.0930 1.1036 1.0781
irintensity: 0.3211 0.1451 2.1585 1.7387 0.9688 0.4612 4.6578 3.9385 7.3480 4.3849 0.0749 0.3766 5.2854 4.1632 0.1731 3.9879 4.0078 66.4241 33.4082 15.0663 5.3454 1.0053 23.4151 1.5830 18.5411 3.2528 10.0923 75.4930 4.0248 13.8959 16.7239 6.6543 2.7076 1.2074 6.5059 1.9522 0.1744 1.0569 9.6998 0.4715 0.0255 8.8700 23.4759 15.9408 3.0570 0.5234 4.8486 5.5759 196.0883 0.8854 7.1677 1.0188 1.9780 13.1266 10.2168 4.9253 34.1217 63.2779 1.0801 50.7361 29.6673 45.9506 22.2851 30.5486 9.6897 5.1682 5.3008 98.4114 66.4059 28.4442 2.2821 39.1768 13.4928 26.6116 8.2371 21.8095 16.8168 4.8208 8.4567 3.9193 23.3222
temp: 298.150 k
press: 1.00000 atm
elementType: 8 7 7 7 6 6 6 6 6 6 6 6 6 6 6 6 1 1 1 1 1 1 1 1 1 1 1 1 1
symmnumber: 1
zpe: 600043.8 jmol-1
zpe.correction: 0.228545 hartree
zpe.thermalcorrener: 0.243672 hartree
zpe.thermalcorrenthalpy: 0.244616 hartree
zpe.thermalcorrgfe: 0.184438 hartree
zpe.sumelectzpe: -703.374582 hartree
zpe.sumelectthermal: -703.359455 hartree
zpe.sumelectthermalent: -703.358511 hartree
zpe.sumelectthermalfe: -703.418689 hartree
dipole: 0.0145 0.5713 -2.9147
dipole: 2.9702
quadrupole: -107.0645 -85.7372 -96.0178
quadrupole: 1.6604 -2.8518 -1.3730
quadrupole: -10.7914 10.5360 0.2553 1.6604 -2.8518 -1.3730
hfenergy: -703.6031269 hartree
pointgroup: C01 [X(C12H13N3O1)]
dipole: 0.0063349 -0.2342114 1.1448256 debye
polarizability: 205.2254452|-0.7884075|132.3913073|-5.6270952|-11.5556905|109.1634839 unknown
InChI: InChI=1S/C12H13N3O/c1-9-3-4-10(2)15(9)14-12(16)11-5-7-13-8-6-11/h3-8,14H,1-2H3
charge 0 multiplicity 1
29 atoms
O  -0.022735 0.50532 -1.698546
N  1.88942 -0.043688 0.310389
N  0.510096 -0.101717 0.497754
N  -4.634038 -0.191973 0.417372
C  2.671964 1.125382 0.462479
C  2.686352 -1.139869 -0.095391
C  3.984126 0.748689 0.171759
C  3.993161 -0.655161 -0.173639
C  2.064572 2.444873 0.837366
C  2.098274 -2.491357 -0.374249
C  -0.390978 0.162691 -0.542493
C  -1.845814 0.01649 -0.16241
C  -2.803092 0.737579 -0.917419
C  -2.313264 -0.828208 0.876766
C  -4.170087 0.607901 -0.591785
C  -3.703608 -0.897482 1.12541
H  4.844611 1.415886 0.195396
H  4.8617 -1.246965 -0.459326
H  0.175817 -0.246744 1.453689
H  2.856589 3.2099 0.886014
H  1.319123 2.779533 0.090719
H  1.562338 2.42172 1.824679
H  1.591871 -2.926886 0.509521
H  1.359935 -2.456998 -1.198219
H  2.901565 -3.184222 -0.673569
H  -2.470116 1.372608 -1.743616
H  -1.635142 -1.458756 1.462483
H  -4.9346 1.156714 -1.152147
H  -4.09784 -1.546257 1.915514
