program: Gaussian 09
title: 000230245
version: EM64L-G09RevD.01
frameworkgroup: C1[X(C4H6ClIO2)]
method: RPBEPBE
basis: SDD
operation: Freq
keyword: #p
keyword: freq=noraman
keyword: PBEPBE/SDD
title: #p freq=noraman PBEPBE/SDD
converged: YES YES NO NO
title: Mulliken charges:
elementType: I Cl O O C C C C H H H H H H
charge: 0.053686 -0.012072 -0.261064 -0.206283 -0.221680 -0.731327 0.365338 -0.682008 0.243989 0.273324 0.285394 0.301201 0.291319 0.300182
chargesum: 0.00000
title: Mulliken charges with hydrogens summed into heavy atoms:
elementType: I Cl O O C C C C
charge: 0.053686 -0.012072 -0.261064 -0.206283 0.295633 -0.144731 0.365338 -0.090507
polarizability: 9.23385221e+01 3.78679586e+00 7.92170568e+01 4.84607173e+00 -5.50976835e+00 5.44374834e+01
1716.lowfreq: -18.8951 -13.4564 -5.0344 -0.0019 -0.0018 -0.0018 4.8257 17.7608 42.9435
frequency: -17.6570 17.5282 42.9317 118.4034 167.3611 215.3076 267.5467 336.4219 405.2384 491.3516 534.0855 659.7481 721.6200 778.5519 867.8660 913.4936 934.7142 963.3819 1065.0660 1095.1815 1162.9721 1170.5328 1191.5440 1258.0507 1285.4316 1351.8783 1424.5688 1426.5401 1465.0140 1681.4978 2994.1699 3058.7248 3064.7280 3082.6694 3143.8361 3151.1054
redmass: 11.2677 6.4247 4.6413 5.5025 4.8224 3.9031 3.3135 5.8972 3.8615 3.4291 3.1646 6.4145 4.9035 2.6457 2.6274 1.9049 3.4665 1.5041 2.3400 2.9809 1.2123 1.3989 1.1844 1.1632 1.3787 1.3759 1.0898 1.1085 1.0761 10.6460 1.0616 1.0588 1.0600 1.0990 1.1058 1.1090
irintensity: 2.1284 0.8420 4.9202 1.0943 3.8100 2.0221 8.1541 11.3850 11.2138 8.8672 5.1220 6.8688 29.6445 0.7748 11.3610 10.9570 80.4767 12.0913 23.7180 349.6665 47.1567 5.4831 2.9364 45.6372 20.7845 6.8831 30.2014 11.3471 17.7828 167.5675 18.6860 7.5539 11.4067 5.4652 1.4311 2.6323
temp: 298.150 k
press: 1.00000 atm
elementType: 53 17 8 8 6 6 6 6 1 1 1 1 1 1
symmnumber: 1
zpe: 254260.7 jmol-1
zpe.correction: 0.096843 hartree
zpe.thermalcorrener: 0.105541 hartree
zpe.thermalcorrenthalpy: 0.106485 hartree
zpe.thermalcorrgfe: 0.058688 hartree
zpe.sumelectzpe: -777.396566 hartree
zpe.sumelectthermal: -777.387868 hartree
zpe.sumelectthermalent: -777.386923 hartree
zpe.sumelectthermalfe: -777.434720 hartree
dipole: -2.3364 1.7700 -2.4047
dipole: 3.7913
quadrupole: -82.0783 -60.7351 -71.3089
quadrupole: -4.3811 -5.7201 -2.3451
quadrupole: -10.7042 10.6390 0.0652 -4.3811 -5.7201 -2.3451
hfenergy: -777.4934083 hartree
pointgroup: C01[X(C4H6Cl1I1O2)]
dipole: -1.0531905 -0.2389516 1.0289079 debye
dipolederiv: -0.1174387 0.0484959 -0.0078503 0.1328583 -0.2627126 0.0853314 -0.059354 0.1193973 -0.1359655 -0.4439662 -0.0206977 0.023864 0.0156528 -0.129219 -0.0009909 0.0552368 0.0014625 -0.1334438 -1.6417028 -0.104426 0.2960608 -0.3668338 -0.3812988 -0.0350454 0.3524559 -0.0845407 -0.5070042 -0.6143659 -0.0644336 0.039492 0.0825297 -0.5459789 -0.3061154 0.3326836 -0.2387941 -0.641525 0.7722614 0.0520384 0.0264333 0.4161828 0.1282284 -0.0012615 0.1033637 0.0981509 0.1272728 0.0094733 -0.1475148 0.0836554 -0.261816 0.4788484 -0.2689237 0.1498265 -0.3012075 0.2254508 1.5134231 0.1940385 -0.3576276 0.3260393 0.6881081 0.3776973 -0.7283254 0.3625501 0.8674365 0.5555149 -0.0871548 -0.0853446 -0.2759379 -0.0704955 -0.0885883 -0.1479969 -0.0990424 0.1120284 -0.0915538 0.0980717 -0.0472725 -0.063818 -0.0635694 0.093109 -0.0102137 0.0872244 0.0597643 0.0552713 -0.0082836 0.0411605 -0.0754368 0.0946264 -0.0139426 -0.0423965 -0.0624487 -0.0177663 -0.0307992 -0.0308029 -0.0203551 -0.0565226 -0.0707789 0.045469 -0.0222896 0.0589502 0.0720054 0.0995977 0.0273936 -0.0363333 0.085525 -0.0173761 0.0692781 -0.0029876 0.0266932 -0.0938718 -0.0198658 -0.0039479 0.0562537 0.0099935 0.1267766 0.0077932 0.0292542 -0.020606 -0.0304106 -0.0458494 0.0472231 -0.0121364 0.0315836 0.0248413 0.03619 -0.0092572 0.0522109 0.096029 unknown
polarizability: 91.2656524|-6.4330701|75.2299846|-2.2659814|-11.8236263|59.4974253 unknown
InChI: InChI=1S/C4H6ClIO2/c5-3-4(7)8-2-1-6/h1-3H2
charge 0 multiplicity 1
14 atoms
I  -3.029974 1.350041 -0.758807
Cl 3.600376 0.663656 -0.13457
O  -0.236349 -0.18924 0.61344
O  1.116791 -0.948672 -1.141572
C  -1.336182 -1.097129 0.195447
C  -2.660437 -0.422795 0.514615
C  0.923825 -0.188985 -0.177836
C  1.823552 0.921709 0.346978
H  -1.238762 -2.023585 0.795292
H  -1.221105 -1.349743 -0.872538
H  -3.504168 -1.101435 0.316638
H  -2.698399 -0.047846 1.547627
H  1.773278 0.97377 1.442911
H  1.507551 1.883953 -0.086325
