program: Gaussian 09
title: 000230244
version: EM64L-G09RevD.01
frameworkgroup: C1[X(C13H13NO2)]
method: RPBEPBE
basis: SDD
operation: Freq
keyword: #p
keyword: freq=noraman
keyword: PBEPBE/SDD
title: #p freq=noraman PBEPBE/SDD
converged: YES YES NO NO
title: Mulliken charges:
elementType: O O N C C C C C C C C C C C C C H H H H H H H H H H H H H
charge: -0.342164 -0.266628 -0.366682 0.394771 0.381753 -0.605476 0.395855 -0.407590 -0.411937 -0.408206 -0.338916 -0.241902 -0.244582 -0.344203 0.270115 -0.644439 0.259235 0.237328 0.237405 0.239291 0.291108 0.227144 0.227342 0.219487 0.253965 0.325023 0.236173 0.206472 0.220260
chargesum: 0.00000
title: Mulliken charges with hydrogens summed into heavy atoms:
elementType: O O N C C C C C C C C C C C C C
charge: -0.342164 -0.266628 -0.041660 0.394771 0.381753 -0.346241 0.395855 -0.170262 -0.174532 -0.168915 -0.047809 -0.014758 -0.017241 0.129248 0.270115 0.018467
polarizability: 2.69370284e+02 7.01194604e+00 1.50636397e+02 -1.04664440e+01 3.30878891e+00 7.46942781e+01
1716.lowfreq: -13.0466 -2.5335 -0.0003 0.0003 0.0005 7.8332 8.7397 20.8902 36.6148
frequency: -11.8407 20.8008 36.5999 75.9885 116.1451 136.8707 180.3814 200.2809 238.2702 261.4082 301.3846 326.2261 391.9805 403.1955 423.6294 476.6913 511.8367 526.3026 536.2622 581.7550 618.0515 640.3796 671.7927 685.7278 715.8709 757.4451 758.9549 777.0380 783.3827 823.3259 863.2333 867.8296 892.2098 905.4914 932.4786 956.1710 966.6994 973.8620 989.7251 1022.5412 1073.4418 1104.2761 1125.9329 1145.8022 1151.4379 1163.5388 1172.6849 1193.8053 1238.7106 1249.2815 1272.7431 1286.6206 1353.5864 1358.6762 1390.2201 1408.0019 1423.5291 1438.4040 1458.5264 1467.8848 1470.7115 1481.9734 1489.6453 1513.3141 1580.9996 1604.2767 1642.8657 1689.3217 2984.4469 2998.0419 3069.5282 3087.4822 3099.6941 3119.7827 3125.3309 3132.6806 3142.3380 3152.1931 3161.5904 3203.2991 3565.8641
redmass: 4.9551 3.0022 4.7168 4.0647 3.3853 5.7198 3.3145 1.5769 6.0980 2.4248 5.1327 4.0641 3.6514 3.1935 3.2609 2.4767 6.6025 3.7239 5.7453 1.1801 6.2916 3.2321 4.9365 9.6922 5.7453 1.3292 4.1736 2.4147 1.4907 1.3572 3.1456 1.5511 2.3387 1.7407 4.4985 1.3944 2.9815 1.4559 1.3418 2.2559 3.0155 2.1450 1.9153 1.7390 1.7972 1.3928 1.0874 2.1121 2.4574 1.6502 1.7656 1.1588 1.7659 1.3124 1.2189 5.6254 3.5315 3.6655 2.1921 1.1124 1.0579 1.0716 1.7464 3.7053 7.5412 5.7335 6.9815 9.8175 1.0359 1.0663 1.0982 1.0976 1.1019 1.0855 1.0889 1.0906 1.0951 1.0922 1.1004 1.0945 1.0771
irintensity: 2.7246 0.0975 4.9032 1.0600 2.2081 0.1304 1.9145 3.2974 0.4393 0.3163 1.5150 24.1995 0.9935 0.9231 0.9889 22.9521 1.1159 1.8511 0.3226 124.7031 1.6565 3.6839 5.2827 21.8754 2.6495 47.2053 2.6231 0.9925 7.2363 46.1121 18.8787 45.1365 1.9535 19.3607 16.8600 12.5552 179.2242 15.6594 0.0256 2.3413 40.6929 5.2654 131.8055 26.4810 474.5714 154.3930 6.0663 252.9065 70.3695 49.0777 8.7117 50.8077 15.9974 3.0989 20.7490 4.1610 1.4568 0.5329 177.6209 34.2524 6.2771 17.0648 318.7463 34.0791 3.9290 28.3189 30.6363 270.0348 28.2569 54.0749 9.9028 37.1121 35.9345 3.3536 0.4032 11.1551 35.4341 7.9658 36.1134 2.2280 37.9275
temp: 298.150 k
press: 1.00000 atm
elementType: 8 8 7 6 6 6 6 6 6 6 6 6 6 6 6 6 1 1 1 1 1 1 1 1 1 1 1 1 1
symmnumber: 1
zpe: 604955.7 jmol-1
zpe.correction: 0.230415 hartree
zpe.thermalcorrener: 0.243889 hartree
zpe.thermalcorrenthalpy: 0.244833 hartree
zpe.thermalcorrgfe: 0.188731 hartree
zpe.sumelectzpe: -707.264971 hartree
zpe.sumelectthermal: -707.251497 hartree
zpe.sumelectthermalent: -707.250553 hartree
zpe.sumelectthermalfe: -707.306655 hartree
dipole: 1.6171 -2.1033 -0.9743
dipole: 2.8263
quadrupole: -68.5299 -86.6690 -98.8362
quadrupole: -7.9342 -4.6707 -0.5274
quadrupole: 16.1484 -1.9906 -14.1579 -7.9342 -4.6707 -0.5274
hfenergy: -707.4953861 hartree
pointgroup: C01 [X(C13H13N1O2)]
dipole: 0.6781617 -0.6049914 0.6407464 debye
polarizability: 267.7102366|-9.1553607|82.8362069|-17.4668928|-23.2516115|144.1545161 unknown
InChI: InChI=1S/C13H13NO2/c1-2-14-13(15)16-12-8-7-10-5-3-4-6-11(10)9-12/h3-9,14H,2H2,1H3
charge 0 multiplicity 1
29 atoms
O  1.561052 -0.689611 0.020262
O  2.633045 0.685772 -1.618643
N  3.807107 -0.729422 -0.153675
C  -2.091906 -0.35364 0.547641
C  -2.552689 0.097555 -0.751117
C  -0.693227 -0.575451 0.750644
C  0.21079 -0.361886 -0.29049
C  -1.586137 0.302776 -1.789175
C  -3.055026 -0.562869 1.591273
C  -3.954395 0.321668 -0.954269
C  -0.224187 0.07991 -1.581406
C  -4.413905 -0.335311 1.363081
C  -4.869023 0.110497 0.0800
C  5.162195 -0.374405 -0.604305
C  2.68063 -0.153038 -0.687863
C  5.94706 0.43971 0.445603
H  -0.322201 -0.918051 1.722092
H  -1.930075 0.644892 -2.772409
H  -2.707806 -0.904006 2.573909
H  -4.29893 0.663287 -1.937832
H  0.505732 0.257536 -2.371931
H  -5.140594 -0.497195 2.16696
H  -5.938055 0.284668 -0.084139
H  5.710977 -1.301464 -0.859198
H  5.043315 0.210424 -1.531865
H  3.677677 -1.378327 0.623864
H  5.4280 1.387394 0.670501
H  6.065155 -0.124178 1.389429
H  6.956821 0.677966 0.064458
