program: Gaussian 09
title: 000230232
version: EM64L-G09RevD.01
frameworkgroup: C1[X(C21H24O6)]
method: RPBEPBE
basis: SDD
operation: Freq
keyword: #pfreq=noraman
keyword: PBEPBE/SDD
title: #p freq=noraman PBEPBE/SDD
converged: YES YES NO NO
title: Mulliken charges:
elementType: O O O O O O C C C C C C C C C C C C C C C C C C C C C H H H H H H H H H H H H H H H H H H H H H H H H
charge: -0.189065 -0.210158 -0.307988 -0.327905 -0.299739 -0.434747 -0.136652 -0.221270 -0.362367 -0.622462 -0.636669 0.170210 0.587396 0.562985 -0.549675 -0.432455 -0.502317 -0.426903 0.222983 -0.354754 0.235758 -0.340809 0.178165 0.117368 -0.540424 -0.533039 -0.531305 0.243711 0.283830 0.232825 0.222150 0.207949 0.235472 0.247248 0.213069 0.255825 0.233428 0.227626 0.245265 0.247448 0.253856 0.380918 0.225938 0.248857 0.257490 0.220005 0.243186 0.248957 0.230336 0.221957 0.258492
chargesum: 0.00000
title: Mulliken charges with hydrogens summed into heavy atoms:
elementType: O O O O O O C C C C C C C C C C C C C C C C C C C C C
charge: -0.189065 -0.210158 -0.307988 -0.327905 -0.299739 -0.053829 0.107058 0.062560 0.092608 -0.179041 -0.176352 0.170210 0.587396 0.562985 -0.293849 -0.199027 -0.274692 -0.181638 0.222983 -0.107306 0.235758 -0.086952 0.178165 0.117368 0.191861 0.179110 0.179481
polarizability: 2.98137705e+02 -1.60650147e+01 1.78800554e+02 -1.62773386e+00 -2.86048013e+01 2.33187743e+02
1716.lowfreq: -8.2413 -6.8097 -0.0006 -0.0004 0.0007 5.0935 10.0483 26.3338 31.2837
frequency: 9.6213 26.0128 31.1797 40.4511 52.4764 56.7280 68.9069 80.1212 89.3708 113.5714 118.5849 133.7390 143.1584 155.8242 164.5185 167.8305 173.2423 185.3394 193.7324 212.7753 232.3560 250.9866 273.1091 286.9413 297.7204 307.0254 340.5983 348.4210 353.7644 387.3659 422.3437 441.6441 456.3507 471.2079 487.4513 490.5843 502.7510 530.3462 534.2816 537.6253 575.1300 605.1637 634.6307 643.3168 652.4304 690.2764 708.0837 715.5069 720.1414 741.5068 755.5128 772.8930 806.6372 819.3645 834.7049 842.0169 856.7322 868.5680 886.3522 901.7062 903.1914 928.2800 939.1260 942.3906 947.8836 950.8229 977.8475 990.5032 1006.9058 1020.0779 1058.5878 1074.1022 1093.0031 1108.6366 1112.8809 1114.9185 1115.6867 1121.8400 1139.2777 1141.8326 1152.6026 1155.5982 1157.3209 1159.6465 1166.6790 1187.4490 1196.6179 1211.7218 1216.2943 1224.2237 1245.6853 1256.2508 1263.8417 1271.9823 1297.9158 1305.8959 1317.0676 1318.4017 1333.1253 1343.1488 1366.1831 1399.7000 1411.6809 1423.3414 1425.3091 1443.7959 1448.5315 1457.6855 1461.2828 1466.5053 1469.8687 1470.2334 1473.6150 1477.1168 1481.1265 1485.5082 1488.4504 1507.5382 1570.7426 1608.7080 1612.6654 1620.7621 1697.2326 2965.2587 2974.7663 2982.7067 2984.5981 2986.2956 3009.2192 3025.4487 3044.4305 3045.2480 3055.2295 3057.5811 3072.8962 3083.6505 3092.0461 3116.1824 3123.9566 3126.2605 3127.2014 3134.1688 3140.2222 3143.3441 3153.2300 3168.2313 3506.8760
redmass: 5.1016 5.8566 5.6998 5.1683 4.9061 4.8788 5.1405 4.3025 3.1074 2.8409 3.7900 6.0722 4.1878 3.2150 1.7550 1.2444 2.1102 2.5015 1.6028 3.9654 2.8530 3.5565 2.9808 3.2161 4.0903 2.5159 3.5253 4.2198 3.9467 4.5316 4.5512 3.0756 4.9289 4.2083 3.7749 3.5456 1.1531 4.0686 5.1993 5.2098 4.4610 5.8547 5.6692 5.1521 5.2518 5.2382 5.9050 4.9192 4.1993 3.8114 3.8272 5.1284 2.0705 1.5509 1.6174 1.9916 2.4859 2.5702 3.3980 1.6491 2.9236 2.6882 1.4258 3.5081 3.3875 1.6097 3.4402 2.7941 4.3502 3.8192 2.2024 3.1165 2.5753 2.6190 1.2502 1.2618 1.8819 1.2639 1.5178 1.8460 1.2284 1.2918 1.4220 1.5081 1.0919 1.3774 1.8361 1.2551 1.9762 1.5298 2.0929 1.3248 2.2871 2.2968 1.3388 1.5595 1.6512 1.3288 1.4336 1.4471 6.0160 2.2313 3.7813 2.1142 1.1808 1.3740 1.5218 1.0558 1.0719 1.0509 1.1096 1.1039 1.0849 1.0962 1.0860 2.5631 1.0593 3.1023 7.2342 6.6298 6.7031 6.7765 12.5341 1.0324 1.0313 1.0599 1.0297 1.0613 1.0657 1.0841 1.0957 1.0941 1.0945 1.1044 1.1031 1.1047 1.1059 1.0886 1.1032 1.1035 1.1001 1.0895 1.0918 1.0906 1.0954 1.0956 1.0645
irintensity: 0.6034 0.5186 1.0715 0.4083 0.9904 0.9328 3.3480 1.8721 8.9319 4.5469 3.6881 1.5645 3.8229 1.0680 4.4988 0.7887 0.8285 8.8623 0.0994 2.0480 3.2494 7.7029 0.1948 3.5270 4.1323 1.1039 4.8289 1.3203 0.7926 0.6224 4.5813 12.6880 3.0235 0.9256 11.3418 7.6082 138.4112 4.7299 4.8972 20.8520 10.1800 16.8583 1.6737 14.1494 6.3331 2.0315 6.0719 6.4492 5.5548 5.1227 2.5144 15.3667 2.3909 78.3845 39.6236 2.5301 27.4452 5.7551 7.3208 13.2600 11.9526 19.3744 4.3616 34.4104 39.9341 17.5308 21.3978 66.6170 40.7973 0.9100 8.8771 139.6498 49.5633 63.0185 14.3186 6.5126 28.0389 1.8173 10.9524 23.6871 1.2457 2.3412 5.2069 53.2199 1.4322 148.9819 62.7845 3.8729 14.9774 20.5636 69.7703 7.0033 55.6640 57.1459 4.7568 20.5093 26.7546 10.9214 1.6439 1.2670 10.7630 16.5907 20.8157 28.3881 0.6195 12.4309 15.7924 13.1738 9.1247 12.9487 22.2340 13.3658 36.3254 4.9521 8.0894 100.0400 38.3252 108.9035 8.3859 12.1128 3.8282 13.6647 296.3642 47.1156 84.6207 35.7460 35.2358 26.5706 41.8816 15.6557 22.4214 2.2834 18.8558 33.5803 24.7932 15.3313 24.4176 12.4155 19.4599 23.6472 19.6175 6.4567 6.0474 10.4704 7.5746 4.7328 71.3197
temp: 298.150 k
press: 1.00000 atm
elementType: 8 8 8 8 8 8 6 6 6 6 6 6 6 6 6 6 6 6 6 6 6 6 6 6 6 6 6 1 1 1 1 1 1 1 1 1 1 1 1 1 1 1 1 1 1 1 1 1 1 1 1
symmnumber: 1
zpe: 1070996.5 jmol-1
zpe.correction: 0.407921 hartree
zpe.thermalcorrener: 0.434727 hartree
zpe.thermalcorrenthalpy: 0.435671 hartree
zpe.thermalcorrgfe: 0.348754 hartree
zpe.sumelectzpe: -1263.924894 hartree
zpe.sumelectthermal: -1263.898088 hartree
zpe.sumelectthermalent: -1263.897144 hartree
zpe.sumelectthermalfe: -1263.984061 hartree
dipole: -3.5214 -1.6308 5.8709
dipole: 7.0376
quadrupole: -177.4893 -163.8369 -148.2644
quadrupole: 5.4159 16.3515 -1.7447
quadrupole: -14.2925 -0.6400 14.9324 5.4159 16.3515 -1.7447
hfenergy: -1264.3328148 hartree
pointgroup: C01 [X(C21H24O6)]
dipole: 1.5300704 0.5019639 2.2523558 debye
polarizability: 296.3261128|-20.6419191|179.0314266|-0.6827817|27.9234004|234.7684632 unknown
InChI: InChI=1S/C21H24O6/c1-24-18-7-5-13(11-20(18)26-3)8-15-12-27-21(23)16(15)9-14-4-6-17(22)19(10-14)25-2/h4-7,10-11,15-16,22H,8-9,12H2,1-3H3
charge 0 multiplicity 1
51 atoms
O  -4.810425 1.262362 0.286648
O  -4.711385 0.180905 -1.766171
O  2.214278 1.416544 -2.29751
O  2.088559 -2.339505 1.665006
O  3.966733 1.498722 0.061025
O  2.716054 -3.342837 -0.72707
C  -2.485693 1.073157 0.984548
C  -2.733439 0.131121 -0.227148
C  -3.92814 1.359638 1.485263
C  -1.729464 2.385232 0.602422
C  -2.651891 -1.407373 0.08348
C  -4.152546 0.494819 -0.703592
C  -0.233264 2.173939 0.419112
C  -1.24641 -1.965516 -0.089644
C  0.336046 1.91423 -0.850836
C  0.624605 2.189124 1.550836
C  -0.283622 -1.888644 0.953674
C  -0.864484 -2.531684 -1.330637
C  1.71788 1.663463 -0.998662
C  2.011924 1.97426 1.411002
C  1.026782 -2.352441 0.736846
C  0.451176 -3.002697 -1.549306
C  2.573291 1.72229 0.140138
C  1.402629 -2.906699 -0.520163
C  2.817105 0.070936 -2.485115
C  1.866261 -1.671829 2.948363
C  4.706875 2.459305 -0.792559
H  -1.90775 0.561913 1.775499
H  -2.035674 0.336269 -1.056938
H  -4.060488 2.373457 1.895808
H  -4.280191 0.611925 2.219341
H  -1.892078 3.120994 1.414236
H  -2.183545 2.813987 -0.311846
H  -3.333703 -1.929609 -0.612548
H  -3.031421 -1.588373 1.108293
H  -0.28072 1.893808 -1.756652
H  0.207797 2.403409 2.543004
H  -0.564786 -1.464445 1.92354
H  -1.601626 -2.604416 -2.138403
H  2.689471 2.024615 2.270178
H  0.748803 -3.446209 -2.50416
H  3.230798 -3.182156 0.108752
H  3.198619 0.065374 -3.517192
H  3.638049 -0.099862 -1.765938
H  2.043957 -0.707807 -2.35995
H  1.079653 -2.188796 3.531271
H  2.825755 -1.736151 3.482069
H  1.591475 -0.611801 2.791238
H  5.750529 2.11033 -0.785853
H  4.645287 3.475111 -0.358161
H  4.304953 2.46791 -1.821141
