program: Gaussian 09
title: 000021812
version: EM64L-G09RevD.01
frameworkgroup: C1[X(C19H25ClN2O)]
method: RPBEPBE
basis: SDD
operation: Freq
keyword: #p
keyword: freq=noraman
keyword: PBEPBE/SDD
title: #p freq=noraman PBEPBE/SDD
converged: YES YES NO NO
title: Mulliken charges:
elementType: Cl O N N C C C C C C C C C C C C C C C C C C C H H H H H H H H H H H H H H H H H H H H H H H H H
charge: -0.058405 -0.289366 -0.032679 -0.078403 -0.389737 -0.563460 -0.386293 0.229293 -0.394541 -0.501122 -0.036764 0.134846 0.268071 -0.069190 -0.294219 -0.410009 -0.349072 -0.328839 -0.306014 -0.252742 -0.105720 -0.626187 -0.614248 0.205888 0.198062 0.210291 0.243011 0.187954 0.205645 0.212614 0.208517 0.241082 0.199391 0.214077 0.207104 0.228471 0.223676 0.262617 0.172980 0.206258 0.288689 0.256225 0.221949 0.184736 0.238732 0.186913 0.224382 0.225535
chargesum: 0.00000
title: Mulliken charges with hydrogens summed into heavy atoms:
elementType: Cl O N N C C C C C C C C C C C C C C C C C C C
charge: -0.058405 -0.289366 -0.032679 -0.078403 0.014213 -0.110158 0.007307 0.229293 0.026591 -0.060649 -0.036764 0.134846 0.268071 -0.069190 0.126961 0.042137 -0.086455 0.050399 -0.017325 0.003483 -0.105720 0.019230 0.022583
polarizability: 2.75110060e+02 -2.67479821e+01 3.11288572e+02 1.49673476e+01 -3.15834400e+00 1.46453878e+02
1716.lowfreq: -8.4242 -3.6882 -0.0011 -0.0007 0.0018 4.3421 7.4936 18.7807 34.6238
frequency: 6.6229 18.4391 34.4262 50.6383 62.7247 74.9813 94.8422 99.2977 118.1127 127.6533 129.6408 163.4060 190.5485 213.4100 227.0745 241.6046 244.3180 260.9446 283.0444 286.6909 320.0918 330.3531 334.6347 347.1390 363.2630 372.3015 417.4877 427.4376 450.1550 469.3359 473.8727 498.7434 524.0644 560.2377 589.4773 601.0977 651.5663 673.0849 688.8326 721.6457 760.6838 772.1635 791.0532 805.9581 828.1115 831.4083 838.3296 865.5161 873.8921 877.2815 895.2552 898.5168 929.3501 953.9383 959.6843 966.4324 1022.6447 1027.4678 1033.4886 1044.2406 1055.4186 1068.3602 1070.1654 1082.5576 1093.0602 1099.3120 1106.4979 1118.5942 1131.2437 1141.3127 1158.3650 1171.8896 1202.5601 1205.3437 1217.3297 1222.5764 1244.5406 1251.6950 1259.9759 1268.1833 1272.3649 1286.2678 1301.2280 1311.8023 1317.5582 1321.0028 1336.2860 1341.5117 1354.9791 1364.3432 1379.3676 1382.2616 1390.8188 1415.3776 1419.1242 1422.8850 1442.7274 1457.9456 1460.9760 1461.2045 1462.0768 1464.1525 1469.3736 1473.7740 1475.0827 1476.5225 1478.1370 1480.5265 1486.7554 1494.6463 1544.2295 1575.2006 1607.8495 2813.3242 2842.1373 2859.1716 2951.9842 2957.8660 2967.2957 2969.0632 2971.5510 2977.3155 2997.8416 3006.8179 3009.5144 3017.2764 3019.3805 3026.9689 3033.3791 3038.5578 3055.4981 3070.6167 3075.4646 3078.6085 3090.2851 3151.5406 3175.1680 3180.4665
redmass: 3.8090 2.9924 4.2180 4.8288 3.2371 3.4152 2.3934 2.9443 3.4593 4.1521 2.7285 4.4598 2.7192 3.4434 1.1729 1.5137 1.9773 8.3725 3.9357 4.1087 3.6211 2.4381 2.2904 3.4414 4.6082 2.8385 3.8530 2.6579 2.8338 3.3516 3.1118 2.3395 3.8350 4.0663 4.9206 4.6356 5.3058 6.6340 6.5507 3.4253 2.9434 1.1432 2.2574 3.8051 1.9419 1.7648 2.3816 2.3394 1.4487 2.6148 1.5379 3.7168 5.2184 1.9062 2.3143 1.3236 2.4697 3.4744 1.6174 2.3288 2.0354 2.2813 2.0891 2.5704 1.3950 1.5400 2.0593 1.9926 1.3759 1.4863 1.6620 1.4499 1.4032 1.3370 1.8129 3.0193 1.5100 1.2901 2.2347 1.2709 1.1951 1.3699 1.2999 2.6747 1.4660 1.4639 1.5545 1.7494 1.4383 2.0697 1.7158 2.0991 1.8556 4.1871 1.1463 7.7123 1.1644 1.1286 1.0838 1.0615 1.0621 1.0945 1.1161 1.6841 1.2163 1.2226 1.0685 1.1376 1.0737 1.1216 8.8416 8.6551 7.5919 1.0705 1.0576 1.0575 1.0562 1.0613 1.0643 1.0667 1.0642 1.0618 1.0828 1.0995 1.0687 1.0959 1.0720 1.1023 1.0714 1.1025 1.0940 1.0942 1.1043 1.1014 1.1005 1.0880 1.0969 1.0937
irintensity: 0.1663 0.4988 0.0645 0.2743 1.2582 0.5649 0.4540 0.5147 0.7392 0.5328 1.2210 0.9532 0.4360 0.6007 1.1437 0.5756 0.4763 0.4586 2.4432 3.0989 1.7623 0.8334 7.4372 3.9435 9.4343 2.2506 4.8698 3.2394 2.6267 4.3881 6.2718 2.6753 8.2643 2.2101 6.8898 8.3112 9.1514 8.8497 8.4108 1.2548 1.0613 2.8698 9.6013 8.9241 1.6131 40.3399 17.1017 11.5819 13.6237 28.1477 22.8596 22.8741 54.7028 17.4147 22.2600 0.7339 38.7508 122.0369 10.5754 25.7768 38.7383 1.3972 4.7677 27.3065 5.9582 5.3463 7.1747 8.6638 8.9389 4.6760 13.2751 4.1032 17.8529 3.1632 9.6952 20.0126 9.7195 6.1534 3.9147 1.1024 0.2450 0.6933 4.4597 78.6770 3.6054 0.1959 13.5389 45.4870 1.6553 25.2040 3.8124 30.9146 18.6555 17.3844 3.3145 8.0301 3.9904 9.2179 6.6331 6.8212 18.1031 4.3983 10.0785 35.6221 26.0754 13.3862 13.9394 21.8068 23.8547 4.6930 37.0351 48.7195 85.0254 75.1855 71.3846 214.0383 32.9459 36.0356 28.9363 26.0691 23.4597 33.3585 14.4812 18.0283 33.9814 80.1220 42.9742 31.7752 44.1000 93.8322 21.2720 15.5922 25.8567 47.9177 43.8751 1.6202 4.7394 1.4142
temp: 298.150 k
press: 1.00000 atm
elementType: 17 8 7 7 6 6 6 6 6 6 6 6 6 6 6 6 6 6 6 6 6 6 6 1 1 1 1 1 1 1 1 1 1 1 1 1 1 1 1 1 1 1 1 1 1 1 1 1
symmnumber: 1
zpe: 1053629.5 jmol-1
zpe.correction: 0.401306 hartree
zpe.thermalcorrener: 0.424151 hartree
zpe.thermalcorrenthalpy: 0.425096 hartree
zpe.thermalcorrgfe: 0.346007 hartree
zpe.sumelectzpe: -1382.061919 hartree
zpe.sumelectthermal: -1382.039073 hartree
zpe.sumelectthermalent: -1382.038129 hartree
zpe.sumelectthermalfe: -1382.117218 hartree
dipole: -4.9051 2.8708 1.0586
dipole: 5.7812
quadrupole: -147.5200 -140.4114 -147.3230
quadrupole: 5.8386 -3.4961 -0.6876
quadrupole: -2.4352 4.6734 -2.2382 5.8386 -3.4961 -0.6876
hfenergy: -1382.4632249 hartree
pointgroup: C01 [X(C19H25Cl1N2O1)]
dipole: 1.8288064 -1.2958255 0.3868004 debye
polarizability: 270.4683365|-23.0381007|315.531776|-16.0671399|6.2007057|146.8523979 unknown
InChI: InChI=1S/C19H25ClN2O/c1-22(2)11-6-12-23-19-15-7-4-3-5-8-17(15)21-18-13-14(20)9-10-16(18)19/h9-10,13H,3-8,11-12H2,1-2H3
charge 0 multiplicity 1
48 atoms
Cl -4.098813 4.493493 0.559659
O  0.981411 0.093363 -0.995668
N  -3.080634 -0.587314 0.097328
N  5.649175 1.223678 0.19575
C  0.266784 -3.600992 0.352036
C  0.017124 -2.654546 -0.859821
C  -0.901967 -4.565828 0.662387
C  -0.863906 -1.458375 -0.552885
C  -2.241043 -3.892674 1.045934
C  -2.869036 -3.006001 -0.068771
C  -2.256398 -1.621127 -0.183967
C  -0.36107 -0.150125 -0.61659
C  -1.207333 0.980645 -0.350622
C  -2.578276 0.703379 0.013234
C  1.940426 0.16641 0.142441
C  3.294348 0.582264 -0.434232
C  -0.763924 2.336872 -0.447087
C  4.392677 0.58438 0.651198
C  -3.463248 1.793216 0.295151
C  -1.637746 3.391958 -0.172217
C  -2.980874 3.09482 0.202535
C  6.305591 0.500886 -0.912798
C  6.578456 1.462338 1.320014
H  1.168688 -4.207481 0.135616
H  0.501574 -2.993418 1.249755
H  -0.437852 -3.250133 -1.67809
H  0.982118 -2.279821 -1.243823
H  -1.072308 -5.209867 -0.226264
H  -0.595402 -5.244356 1.483751
H  -2.114148 -3.286652 1.964958
H  -2.968297 -4.689971 1.2954
H  -3.942802 -2.856848 0.134814
H  -2.784962 -3.542146 -1.037285
H  1.56942 0.903137 0.884503
H  1.994382 -0.828597 0.632863
H  3.219214 1.595998 -0.868138
H  3.546878 -0.112686 -1.25583
H  0.26434 2.537107 -0.763913
H  4.567917 -0.468227 1.004921
H  4.031272 1.159374 1.527206
H  -4.495785 1.565675 0.570803
H  -1.31065 4.432591 -0.248695
H  7.226061 1.037641 -1.202805
H  6.587032 -0.55125 -0.647064
H  5.645896 0.467771 -1.795863
H  6.939269 0.521184 1.809548
H  7.462574 2.016933 0.958192
H  6.081147 2.078723 2.090332
