program: Gaussian 09
title: 000230230
version: EM64L-G09RevD.01
frameworkgroup: C1[X(C10H18N2O5)]
method: RPBEPBE
basis: SDD
operation: Freq
keyword: #p
keyword: freq=noraman
keyword: PBEPBE/SDD
title: #p freq=noraman PBEPBE/SDD
converged: YES YES NO NO
title: Mulliken charges:
elementType: O O O O O N N C C C C C C C C C C H H H H H H H H H H H H H H H H H H
charge: -0.258150 -0.262265 -0.254343 -0.242709 -0.281290 -0.059230 0.045804 -0.411318 -0.376052 -0.507025 -0.497535 0.268248 0.265966 -0.263342 -0.262498 -0.661500 -0.662094 0.269176 0.250910 0.248209 0.262152 0.299564 0.250399 0.252127 0.265935 0.233212 0.225936 0.236641 0.226785 0.231055 0.249928 0.218511 0.228558 0.249006 0.221228
chargesum: 0.00000
title: Mulliken charges with hydrogens summed into heavy atoms:
elementType: O O O O O N N C C C C C C C C C C
charge: -0.258150 -0.262265 -0.254343 -0.242709 -0.281290 -0.059230 0.045804 0.108769 0.134309 0.042937 0.020527 0.268248 0.265966 0.195806 0.200928 0.037995 0.036697
polarizability: 1.69908212e+02 6.12529119e+00 1.44088840e+02 -7.02599202e+00 -2.35538721e+00 1.12653674e+02
1716.lowfreq: -20.8164 -11.8201 -9.4632 -2.4122 -0.0011 -0.0005 -0.0005 3.0800 14.3857
frequency: -19.9770 -8.6281 13.7961 36.8055 50.5242 62.7115 67.7508 73.8978 86.6808 111.4720 120.3103 122.9080 164.3688 210.9955 219.2070 226.0418 270.1537 290.8073 309.8985 329.3330 341.3069 365.8584 389.7253 432.6777 460.6369 485.3860 558.6128 567.5192 628.4558 656.6560 690.4952 755.2218 773.8242 781.9295 800.1182 814.3628 817.4725 868.9621 903.2298 914.6845 975.4187 1005.8688 1009.1144 1016.7521 1054.6609 1065.3367 1094.5090 1095.2360 1096.9857 1136.4957 1145.9822 1153.9289 1157.1397 1158.9100 1230.7868 1242.1294 1277.4501 1278.3801 1282.2403 1295.0795 1311.1938 1329.2089 1337.4894 1355.4030 1356.0093 1368.4022 1378.9053 1390.7572 1390.9516 1439.6784 1443.6211 1454.9315 1457.6166 1457.8008 1461.1580 1462.3870 1464.2297 1484.4112 1484.7875 1632.2585 1638.2418 2993.8451 2994.1175 2999.8491 3002.9753 3015.1394 3017.3550 3029.4644 3032.3086 3060.8396 3081.2683 3089.3167 3089.3830 3094.4176 3094.6530 3097.2708 3101.3831 3120.5538 3121.4668
redmass: 4.0774 4.6471 4.4431 4.2439 3.9617 4.3914 3.7782 3.1870 3.8112 2.6787 2.8929 3.3151 3.2482 1.3830 1.6032 2.3423 4.0428 2.7458 2.9880 3.8531 4.5475 3.7958 3.3646 3.5426 3.3550 4.9586 2.8149 3.0386 4.9218 4.1841 3.0962 1.9869 1.5879 1.7264 1.5527 1.5995 2.0785 4.1704 3.5156 3.7676 3.0277 2.6024 2.7783 2.2116 3.7579 4.0680 2.0242 2.1843 2.0025 3.0665 2.3687 1.5199 1.6909 1.7115 1.4378 1.9628 1.1217 1.1293 1.5381 1.5882 1.4591 2.3960 1.7621 1.3278 1.2827 1.5197 1.5482 1.2330 1.2323 1.0831 1.0856 1.1065 1.0913 1.0838 1.0856 1.0443 1.0444 1.0513 1.0517 8.5222 8.9104 1.0359 1.0361 1.0626 1.0661 1.0618 1.0630 1.0599 1.0597 1.0969 1.0952 1.0975 1.0974 1.1030 1.1028 1.1009 1.1002 1.1060 1.1065
irintensity: 0.3820 1.1156 0.3531 1.0714 1.6496 1.4830 1.2776 1.3770 4.5535 4.2742 5.3699 0.6001 4.0533 2.3893 4.0822 2.7956 3.1549 7.0053 16.7234 5.9671 14.9830 12.0082 2.0164 5.6815 1.3412 8.8415 2.8315 3.9129 9.4095 4.4564 2.8092 9.9086 4.3855 24.9254 10.6395 4.5990 15.9179 33.4235 3.0542 24.6543 105.4225 30.3640 42.5928 45.6562 49.5832 9.5827 109.8604 35.6606 15.0171 278.9531 149.7592 24.2176 24.4055 97.7475 51.6720 31.7095 2.0649 1.0549 91.5405 36.6388 78.1343 94.4910 43.2403 2.5608 6.3223 27.4041 3.2376 22.8036 22.7529 13.5210 5.2465 55.2807 14.7025 8.8580 24.2965 13.9249 15.0002 13.1529 12.7724 146.7966 167.5359 17.1479 18.0104 3.3475 6.2033 3.7547 24.9752 28.7663 29.3779 2.8330 1.2881 37.6682 30.4564 0.5862 1.3457 13.0547 5.7285 31.4128 30.8106
temp: 298.150 k
press: 1.00000 atm
elementType: 8 8 8 8 8 7 7 6 6 6 6 6 6 6 6 6 6 1 1 1 1 1 1 1 1 1 1 1 1 1 1 1 1 1 1
symmnumber: 1
zpe: 739784.2 jmol-1
zpe.correction: 0.281769 hartree
zpe.thermalcorrener: 0.300180 hartree
zpe.thermalcorrenthalpy: 0.301124 hartree
zpe.thermalcorrgfe: 0.232128 hartree
zpe.sumelectzpe: -876.076700 hartree
zpe.sumelectthermal: -876.058289 hartree
zpe.sumelectthermalent: -876.057344 hartree
zpe.sumelectthermalfe: -876.126340 hartree
dipole: -0.8028 -5.1749 -0.8295
dipole: 5.3021
quadrupole: -82.3046 -113.3606 -105.7315
quadrupole: -1.9518 4.2660 6.3221
quadrupole: 18.1609 -12.8950 -5.2659 -1.9518 4.2660 6.3221
hfenergy: -876.3584687 hartree
pointgroup: C01 [X(C10H18N2O5)]
dipole: -0.2980854 1.9954971 0.5297244 debye
polarizability: 168.9566108|-7.3971597|144.5230008|8.804611|0.5891794|113.171114 unknown
InChI: InChI=1S/C10H18N2O5/c1-3-16-9(13)5-7-12(11-15)8-6-10(14)17-4-2/h3-8H2,1-2H3
charge 0 multiplicity 1
35 atoms
O  3.686854 0.941326 1.205407
O  -3.725713 1.038197 0.905193
O  2.735684 1.359001 -0.885127
O  -3.93685 -0.239128 -1.039385
O  1.387945 -3.503714 0.288771
N  -0.008524 -1.880332 -0.376763
N  0.155698 -3.165026 0.111226
C  1.148822 -1.021334 -0.710676
C  -1.398901 -1.469269 -0.633692
C  1.868564 -0.467188 0.540916
C  -1.854842 -0.322067 0.294111
C  2.784856 0.691111 0.176082
C  -3.266736 0.132565 -0.047792
C  4.642933 2.078713 1.002135
C  -5.092226 1.61507 0.68174
C  5.875529 1.617035 0.220962
C  -5.019606 2.833038 -0.2424
H  1.863731 -1.627112 -1.297867
H  0.793164 -0.192523 -1.344421
H  -1.511474 -1.161808 -1.689438
H  -2.025551 -2.362928 -0.478456
H  2.444527 -1.260172 1.044619
H  1.1327 -0.095379 1.280522
H  -1.187509 0.556808 0.200429
H  -1.821895 -0.630698 1.354465
H  4.112707 2.891643 0.475314
H  4.892941 2.387725 2.029366
H  -5.739102 0.825857 0.260213
H  -5.426076 1.88133 1.69692
H  6.36267 0.762678 0.721595
H  5.602013 1.322896 -0.806059
H  6.607002 2.44404 0.158841
H  -4.323931 3.59102 0.156987
H  -4.69069 2.540423 -1.253663
H  -6.020815 3.294604 -0.327675
