program: Gaussian 09
title: 000230216
version: EM64L-G09RevD.01
frameworkgroup: C1[X(C21H18O2)]
method: RPBEPBE
basis: SDD
operation: Freq
keyword: #pfreq=noraman
keyword: PBEPBE/SDD
title: #p freq=noraman PBEPBE/SDD
converged: YES YES NO NO
title: Mulliken charges:
elementType: O O C C C C C C C C C C C C C C C C C C C C C H H H H H H H H H H H H H H H H H H
charge: -0.304054 -0.205247 -0.036828 0.323898 0.438090 0.031227 0.278275 -0.418558 -0.369177 -0.348026 -0.369192 -0.231235 -0.262741 -0.238602 -0.248866 -0.530085 -0.304952 -0.367013 -0.243270 -0.242336 -0.260305 -0.233857 -0.227155 0.285788 0.251567 0.273089 0.256135 0.226066 0.225771 0.227468 0.225396 0.229704 0.215493 0.241460 0.286963 0.273638 0.227792 0.228194 0.231115 0.232107 0.232262
chargesum: 0.00000
title: Mulliken charges with hydrogens summed into heavy atoms:
elementType: O O C C C C C C C C C C C C C C C C C C C C C
charge: -0.304054 -0.205247 -0.036828 0.323898 0.438090 0.031227 0.278275 -0.132770 -0.117610 -0.074937 -0.113058 -0.005170 -0.036970 -0.011135 -0.023470 0.156572 -0.017988 -0.093375 -0.015477 -0.014142 -0.029190 -0.001750 0.005108
polarizability: 2.69448960e+02 -2.04423990e+00 2.35765350e+02 1.41584832e+01 2.39707021e+01 1.74190167e+02
1716.lowfreq: -11.0609 -5.2996 0.0007 0.0007 0.0008 2.6667 23.3203 32.4467 37.8350
frequency: 23.2476 32.2839 37.7978 56.2004 63.1482 82.5215 102.2900 132.2636 148.4661 161.7973 175.7471 186.0656 234.8152 253.4475 257.9230 284.3531 297.9482 347.1184 362.1583 397.9730 402.1496 404.3984 409.9743 455.9578 488.2483 509.8314 583.2338 604.5623 613.9601 615.6748 617.1572 637.3594 677.6394 688.6641 695.1446 704.6594 708.7742 758.5496 770.4753 788.7786 831.3513 851.7021 853.4224 865.1364 900.0835 926.6412 939.6269 943.5847 946.3388 979.1462 985.3089 989.2617 989.5124 991.6779 993.0158 996.2200 1000.0744 1004.7579 1009.4053 1024.6217 1030.0252 1030.4458 1039.8393 1085.7539 1087.8374 1092.8047 1117.6818 1146.5769 1170.9531 1172.5997 1173.5861 1173.9966 1189.7993 1192.6088 1198.8880 1205.9836 1242.1135 1318.1421 1320.8239 1324.4732 1377.0709 1380.7455 1384.0581 1432.6824 1433.2236 1433.6116 1435.0144 1458.1089 1473.4097 1475.5763 1477.9452 1482.5870 1550.2674 1585.8759 1588.3205 1590.3042 1606.3569 1607.9498 1610.4860 2957.6541 3049.0089 3108.8529 3123.7869 3124.0372 3127.8077 3133.4609 3133.9730 3140.4556 3146.0199 3147.3228 3153.4381 3159.3646 3160.0454 3165.9467 3171.2381 3172.5234 3200.8796
redmass: 4.6907 4.0947 4.2178 4.0284 4.9946 4.3450 2.6484 1.7766 4.8079 3.1813 3.6558 4.3897 3.7993 4.1551 4.6131 5.2547 5.0985 6.6150 4.6813 2.7844 3.0564 3.1729 3.8280 4.1563 3.8771 5.0512 4.6140 6.1084 6.4015 6.3928 6.2700 6.3087 5.8047 3.1410 2.0194 1.6328 1.8763 1.8892 2.0966 2.2297 4.8707 1.2598 1.2467 1.2462 2.9648 2.4917 1.9063 1.7404 1.7663 1.3947 1.4243 3.7209 5.7640 4.4214 1.6793 1.3664 1.6557 1.3421 3.1647 4.0880 2.6323 2.3580 2.1962 1.6107 1.5929 1.6635 1.2680 1.7021 1.6009 1.2322 1.0661 1.1633 1.1654 1.1637 1.1342 3.0561 4.8226 1.3317 1.3300 1.3404 7.7969 8.8538 8.4044 1.7842 2.2729 2.1560 1.3214 1.0514 1.0784 2.0947 2.1570 2.1509 9.2188 6.2082 6.2513 6.2744 5.9283 6.0579 6.0789 1.0336 1.1008 1.1004 1.0847 1.0849 1.0854 1.0886 1.0885 1.0894 1.0940 1.0933 1.0943 1.0971 1.0979 1.0996 1.0979 1.0966 1.0939
irintensity: 0.6246 0.5683 0.2601 0.0383 0.4060 0.4345 3.3723 1.2606 0.9795 3.3561 0.4784 0.8906 0.3231 4.9678 3.7373 18.4117 3.0079 0.9947 0.3246 0.2180 0.4819 1.2688 4.9619 0.9096 1.8331 3.7109 5.1984 21.8307 0.7648 0.0229 5.8670 62.5359 1.2653 18.1993 52.4469 52.2175 56.9166 83.4077 23.8228 46.9874 48.0617 1.5111 0.1713 0.4239 1.8683 10.0886 6.3901 0.4332 0.5299 0.2586 1.4938 0.6611 1.7244 0.7191 0.2214 0.5044 0.9159 0.2134 8.7564 76.9919 14.2227 26.8665 3.3194 0.6530 11.9384 7.5506 0.3770 6.8392 24.7244 10.3910 2.9955 2.9538 19.9324 29.6050 3.4689 47.8691 115.6498 3.4470 1.7886 1.3359 0.5227 0.4315 3.6129 14.5337 5.6815 18.3259 7.4052 7.1549 16.4115 0.7257 17.4221 21.2533 119.6493 5.2583 4.2862 2.8578 10.5669 8.7564 0.7363 52.3874 49.1166 19.0006 0.2109 0.3610 0.2802 10.0876 7.7697 12.3328 18.4930 25.0197 15.7479 36.0536 25.1037 30.1726 12.7812 9.6832 5.0850
temp: 298.150 k
press: 1.00000 atm
elementType: 8 8 6 6 6 6 6 6 6 6 6 6 6 6 6 6 6 6 6 6 6 6 6 1 1 1 1 1 1 1 1 1 1 1 1 1 1 1 1 1 1
symmnumber: 1
zpe: 854540.3 jmol-1
zpe.correction: 0.325477 hartree
zpe.thermalcorrener: 0.345339 hartree
zpe.thermalcorrenthalpy: 0.346283 hartree
zpe.thermalcorrgfe: 0.275680 hartree
zpe.sumelectzpe: -959.853943 hartree
zpe.sumelectthermal: -959.834081 hartree
zpe.sumelectthermalent: -959.833137 hartree
zpe.sumelectthermalfe: -959.903739 hartree
dipole: 1.1311 -0.2803 1.9688
dipole: 2.2878
quadrupole: -118.0069 -120.8624 -133.9620
quadrupole: -1.7490 1.8446 0.2225
quadrupole: 6.2702 3.4147 -9.6849 -1.7490 1.8446 0.2225
hfenergy: -960.1794198 hartree
pointgroup: C01 [X(C21H18O2)]
dipole: 0.331651 0.1948486 -0.8137646 debye
polarizability: 262.601459|10.3388777|237.3499117|-27.7943321|20.3957093|179.4531053 unknown
InChI: InChI=1S/C21H18O2/c1-23-21(18-13-7-3-8-14-18,19-15-9-4-10-16-19)20(22)17-11-5-2-6-12-17/h2-16H,1H3
charge 0 multiplicity 1
41 atoms
O  -0.273987 0.260014 -1.600644
O  0.314275 1.090165 1.900885
C  -0.468172 0.004515 -0.150965
C  -0.175235 -1.500996 0.054837
C  -1.921438 0.356462 0.236004
C  0.606176 0.762358 0.713004
C  1.985118 1.03719 0.181048
C  0.071264 -2.359083 -1.043075
C  -2.291104 1.624549 0.753126
C  -0.180226 -2.033867 1.369007
C  -2.946665 -0.576861 -0.064842
C  0.312383 -3.7354 -0.827976
C  -3.649139 1.942559 0.977157
C  0.063653 -3.407442 1.58041
C  -4.303922 -0.259941 0.155773
C  -0.54685 1.632316 -2.041873
C  2.558406 0.379931 -0.94319
C  2.769652 1.983319 0.901117
C  0.313109 -4.264709 0.482637
C  -4.66211 1.00279 0.681498
C  3.882523 0.671406 -1.334025
C  4.085248 2.281979 0.498992
C  4.64729 1.624923 -0.622515
H  0.056301 -1.944135 -2.054533
H  -1.523581 2.36111 1.005752
H  -0.377616 -1.372069 2.219837
H  -2.678202 -1.557173 -0.472476
H  0.496494 -4.393053 -1.685237
H  -3.914052 2.923992 1.386352
H  0.05866 -3.807569 2.600388
H  -5.079343 -0.997678 -0.079332
H  -0.283086 1.646474 -3.11095
H  0.080626 2.369219 -1.501238
H  -1.613564 1.893677 -1.915117
H  1.971924 -0.352562 -1.49927
H  2.324476 2.465655 1.777593
H  0.503558 -5.331175 0.647804
H  -5.714786 1.249696 0.860047
H  4.319024 0.152296 -2.194312
H  4.67464 3.018109 1.0565
H  5.673077 1.851207 -0.935197
