program: Gaussian 09
title: 000230215
version: EM64L-G09RevD.01
frameworkgroup: C1[X(C20H27NO2)]
method: RPBEPBE
basis: SDD
operation: Freq
keyword: #p
keyword: freq=noraman
keyword: PBEPBE/SDD
title: #p freq=noraman PBEPBE/SDD
converged: NO YES NO NO
title: Mulliken charges:
elementType: O O N C C C C C C C C C C C C C C C C C C C C H H H H H H H H H H H H H H H H H H H H H H H H H H H
charge: -0.229203 -0.225579 -0.259503 0.010225 -0.117234 -0.421309 -0.445850 -0.446090 -0.439469 -0.398506 -0.400534 -0.391357 -0.401678 -0.405349 0.123518 -0.385782 0.064131 0.301584 -0.344956 -0.364691 -0.241914 -0.227300 -0.226170 0.247076 0.241913 0.245909 0.196400 0.201307 0.233846 0.228453 0.206953 0.213235 0.230914 0.199544 0.195746 0.195758 0.200546 0.198076 0.197415 0.205003 0.195512 0.195356 0.200527 0.199804 0.195011 0.272099 0.272065 0.236230 0.233776 0.234544
chargesum: 0.00000
title: Mulliken charges with hydrogens summed into heavy atoms:
elementType: O O N C C C C C C C C C C C C C C C C C C C C
charge: -0.229203 -0.225579 -0.259503 0.257301 0.124680 0.021000 -0.010697 -0.010684 0.004680 -0.003216 -0.004230 0.004134 -0.001163 -0.009467 0.123518 0.009033 0.064131 0.301584 -0.072858 -0.092627 -0.005684 0.006476 0.008373
polarizability: 2.53099901e+02 2.60473291e+01 2.18457268e+02 -6.60471792e+00 4.74755730e+00 1.94004534e+02
1716.lowfreq: -19.3375 -13.9673 -0.0008 -0.0006 -0.0004 4.8183 18.8962 22.2981 35.3375
frequency: 13.2084 19.6701 35.1701 51.1670 57.5552 65.0103 83.3183 102.6172 136.9439 170.1643 181.8722 192.3820 204.9225 210.0085 223.0862 226.9320 273.7930 288.8835 334.2516 347.2236 371.9845 402.6684 409.0369 429.2734 430.8464 443.5380 453.3423 461.6112 479.8593 504.8725 535.2607 606.7544 613.9689 669.6107 701.4196 710.3056 718.4559 745.7327 777.8146 788.0781 793.3232 797.0500 810.3621 841.4579 846.3009 863.3072 879.5173 889.9665 892.5885 900.0074 910.0220 920.8409 923.8879 945.5451 959.7695 989.1164 990.5167 1005.3118 1005.8880 1019.5877 1027.8925 1043.8824 1044.9650 1053.8064 1063.0219 1070.8358 1079.7424 1084.3480 1110.3884 1110.7586 1116.9734 1138.5917 1151.3574 1174.1718 1174.8311 1180.7157 1190.4340 1199.7012 1239.0092 1250.7996 1252.3855 1258.9566 1265.4467 1266.6456 1270.3673 1292.1986 1309.3264 1312.3900 1316.9140 1319.3681 1333.6502 1334.3667 1335.5399 1339.1389 1342.0366 1345.7149 1346.5052 1349.5169 1356.5949 1372.0550 1383.7821 1434.8392 1460.2151 1461.6130 1464.0062 1464.4039 1465.5120 1468.6998 1469.6117 1475.0750 1476.5302 1477.3580 1483.6538 1546.1047 1585.3769 1596.7941 1607.4023 2963.7101 2966.0898 2967.1377 2969.4615 2969.9099 2973.1913 2978.7837 2986.7102 2987.1732 2990.3646 3010.9987 3018.7472 3026.1260 3029.0801 3029.2426 3031.4756 3037.2424 3040.3780 3044.0342 3055.6548 3055.9498 3066.8349 3129.8297 3138.9721 3149.6672 3158.8339 3170.0732
redmass: 3.3488 3.9370 5.0600 3.3484 4.0474 3.7352 4.8265 3.5801 5.7624 3.5539 4.2060 4.7887 3.1954 3.0732 1.9895 2.0399 3.4695 4.0794 1.9186 2.3147 3.6579 4.3320 3.1056 3.0736 3.4208 3.5666 4.5278 2.7715 2.0240 1.6728 3.8569 4.2485 6.2642 5.9073 2.5803 5.2918 2.4648 3.6723 2.2764 1.4910 1.5145 2.3622 2.7647 2.1360 2.1677 1.2460 1.6472 1.9519 1.6105 1.8569 3.2237 1.9022 1.6309 1.4658 2.8042 5.4172 1.4245 1.3301 2.7089 2.7217 2.2166 1.5945 1.8165 1.5906 1.1685 1.3272 1.2876 1.5855 2.2896 2.7154 2.7735 2.8879 2.6919 1.3160 1.4545 1.5445 1.2480 1.6409 1.4073 1.3402 1.3265 1.3117 1.2710 1.4460 2.6511 1.2011 1.3282 1.3651 1.3237 1.3796 1.3862 1.3744 1.3658 1.4847 1.4443 1.4908 1.5473 1.3723 1.4986 1.4911 8.9046 2.2387 1.0860 1.0860 1.0871 1.0871 1.0890 1.0846 1.0861 1.1088 1.8205 1.1975 1.0925 10.1497 6.7030 8.1899 6.1079 1.0634 1.0617 1.0624 1.0626 1.0613 1.0635 1.0605 1.0609 1.0612 1.0632 1.0845 1.0857 1.0979 1.0942 1.0990 1.0949 1.1025 1.1035 1.1034 1.1020 1.1008 1.0999 1.0852 1.0881 1.0925 1.0964 1.1013
irintensity: 0.2124 1.5612 0.9769 0.5401 0.2634 0.9929 0.2798 0.0391 6.7831 2.6651 1.6730 1.8887 0.7268 1.2378 0.1328 0.0330 3.7515 3.8305 0.9883 2.2975 1.4306 3.3894 0.2481 0.5874 10.5656 2.2307 1.0764 1.5157 1.0261 0.5653 5.0766 6.3283 0.2151 24.4426 29.7481 36.7660 30.3700 2.9693 2.5293 0.3966 4.7618 40.5671 3.9520 3.1270 4.0694 1.5523 2.8202 7.0062 11.3646 27.1702 24.2229 2.9031 0.3174 3.3153 25.9318 0.8864 2.0181 0.8987 16.6384 24.6210 16.6834 2.8666 0.4573 3.7845 1.7631 2.2764 4.4347 18.2014 3.7501 5.3758 90.6654 5.0189 91.2191 38.9567 46.7322 48.9528 28.3019 1.6424 29.5443 26.8364 4.6924 3.3609 3.3809 23.3485 200.9034 18.3139 2.7915 29.2228 1.8767 31.3133 33.2545 1.3501 10.0446 0.8929 0.3334 15.5929 14.3209 4.2669 5.7363 31.0013 1.8315 11.7493 6.4703 2.3519 7.1192 10.6425 7.9832 20.4244 6.3095 16.1922 1.6743 8.5915 3.9809 258.2953 41.1857 49.7166 3.2461 24.8711 34.0859 31.3833 38.7623 33.9929 37.8800 25.9237 6.9411 59.6837 19.2865 21.6015 10.7130 63.6619 61.5240 71.7941 55.9770 23.5641 39.7735 6.7304 9.0384 105.5024 39.7046 0.1348 4.8784 14.6676 14.5743 19.7765
temp: 298.150 k
press: 1.00000 atm
elementType: 8 8 7 6 6 6 6 6 6 6 6 6 6 6 6 6 6 6 6 6 6 6 6 1 1 1 1 1 1 1 1 1 1 1 1 1 1 1 1 1 1 1 1 1 1 1 1 1 1 1
symmnumber: 1
zpe: 1128969.6 jmol-1
zpe.correction: 0.430002 hartree
zpe.thermalcorrener: 0.451498 hartree
zpe.thermalcorrenthalpy: 0.452442 hartree
zpe.thermalcorrgfe: 0.377330 hartree
zpe.sumelectzpe: -981.819411 hartree
zpe.sumelectthermal: -981.797915 hartree
zpe.sumelectthermalent: -981.796971 hartree
zpe.sumelectthermalfe: -981.872084 hartree
dipole: 2.3582 1.1866 0.0187
dipole: 2.6400
quadrupole: -127.3564 -135.6795 -141.4994
quadrupole: 7.0036 2.3576 -7.5425
quadrupole: 7.4887 -0.8344 -6.6543 7.0036 2.3576 -7.5425
hfenergy: -982.2494132 hartree
pointgroup: C01 [X(C20H27N1O2)]
dipole: -0.9539354 -0.402679 -0.0816979 debye
polarizability: 255.6982107|22.4050833|216.3313952|11.5841501|-1.0644717|193.5320964 unknown
InChI: InChI=1S/C20H27NO2/c22-19(16-10-4-1-5-11-16)21(18-14-8-3-9-15-18)20(23)17-12-6-2-7-13-17/h1,4-5,10-11,17-18H,2-3,6-9,12-15H2
charge 0 multiplicity 1
50 atoms
O  0.502469 1.992307 -1.428903
O  1.111833 -1.547129 1.54621
N  0.907647 0.107753 -0.10668
C  2.39736 0.32345 -0.247553
C  -1.316433 1.352336 0.051279
C  3.021396 0.905328 1.045798
C  3.136608 -0.947787 -0.721928
C  -1.181901 2.550267 1.048488
C  -2.41078 1.650908 -1.005178
C  4.526028 1.201739 0.827748
C  4.63714 -0.632242 -0.943344
C  5.284175 -0.056424 0.338547
C  -2.538769 2.867183 1.717877
C  -3.764311 1.982747 -0.335185
C  0.057172 1.15077 -0.595342
C  -3.633206 3.156373 0.664161
C  0.448713 -1.053001 0.586897
C  -0.771054 -1.75413 0.056498
C  -1.13264 -1.702899 -1.315548
C  -1.507775 -2.581934 0.944387
C  -2.226995 -2.460319 -1.787301
C  -2.609726 -3.323187 0.474145
C  -2.973034 -3.263269 -0.893822
H  2.472219 1.086083 -1.04637
H  -1.612632 0.463631 0.636834
H  2.889855 0.177734 1.866896
H  2.48593 1.832679 1.328766
H  2.679946 -1.317827 -1.660707
H  3.04325 -1.747891 0.035898
H  -0.824028 3.433862 0.48468
H  -0.419303 2.316994 1.817579
H  -2.527091 0.779922 -1.678344
H  -2.073062 2.501241 -1.627948
H  4.970303 1.576998 1.769708
H  4.63864 2.010384 0.075802
H  4.745931 0.100575 -1.769529
H  5.165371 -1.552255 -1.259407
H  6.348056 0.187583 0.152641
H  5.262618 -0.827934 1.135272
H  -2.421069 3.73314 2.397878
H  -2.851212 2.007046 2.345673
H  -4.138826 1.086086 0.201592
H  -4.514209 2.224545 -1.113098
H  -4.603621 3.345389 1.162508
H  -3.36917 4.080169 0.109223
H  -0.543306 -1.099011 -2.013713
H  -1.191861 -2.637922 1.99136
H  -2.49245 -2.429343 -2.849578
H  -3.180901 -3.952431 1.165291
H  -3.824497 -3.846887 -1.261257
