program: Gaussian 09
title: 000230200
version: EM64L-G09RevD.01
frameworkgroup: C1[X(C14H24O2)]
method: RPBEPBE
basis: SDD
operation: Freq
keyword: #pfreq=noraman
keyword: PBEPBE/SDD
title: #p freq=noraman PBEPBE/SDD
converged: YES YES NO NO
title: Mulliken charges:
elementType: O O C C C C C C C C C C C C C C H H H H H H H H H H H H H H H H H H H H H H H H
charge: -0.287924 -0.264365 -0.140954 -0.052224 -0.049402 0.356196 -0.440514 -0.489657 0.021947 -0.469502 -0.782113 -0.208243 -0.736989 -0.734315 -0.212650 -0.729884 0.231609 0.213099 0.249259 0.219888 0.196744 0.232184 0.237919 0.191116 0.205875 0.203659 0.227372 0.213028 0.207795 0.197597 0.227723 0.233514 0.200377 0.237526 0.216083 0.214355 0.197609 0.226758 0.234067 0.205437
chargesum: 0.00000
title: Mulliken charges with hydrogens summed into heavy atoms:
elementType: O O C C C C C C C C C C C C C C
charge: -0.287924 -0.264365 0.090655 0.160875 0.199858 0.356196 -0.023882 -0.019555 0.213064 -0.059968 -0.133918 -0.010646 -0.075375 -0.066351 -0.015041 -0.063622
polarizability: 1.79602413e+02 -3.68892884e+00 1.42970230e+02 -4.23039888e+00 6.86385607e+00 1.36027011e+02
1716.lowfreq: -19.2820 -10.4798 -6.9532 -0.0010 -0.0009 -0.0006 36.8422 59.7228 75.5216
frequency: 36.5982 59.7127 75.4936 121.6697 131.9508 142.7785 155.7261 163.7555 195.8974 201.0416 212.2703 220.8167 249.2473 267.9081 305.2694 319.0212 347.2442 360.8346 380.4907 423.4812 438.7905 451.3525 454.8785 472.0325 483.2629 497.8785 626.0664 645.3269 668.3787 737.6130 768.1986 784.6934 827.4005 839.0820 872.1427 887.6129 894.6956 911.4457 917.8338 920.3701 939.8527 947.2164 959.3268 972.7520 973.6694 990.8441 1017.3067 1041.7673 1056.7478 1085.6575 1090.4537 1092.5797 1117.9677 1128.8965 1143.1684 1151.6375 1169.4839 1201.6200 1212.5001 1224.6998 1228.5173 1260.0533 1277.8628 1286.6394 1291.2817 1295.8527 1305.0463 1321.9178 1335.9453 1346.0870 1354.4868 1357.2627 1364.8358 1373.7511 1379.3762 1383.6622 1388.5568 1390.6914 1431.4189 1453.0858 1454.8781 1459.1051 1462.1042 1465.7748 1470.8323 1471.5496 1479.3781 1487.2326 1488.5433 1677.8778 2918.5310 2927.6770 2936.2156 2965.6435 2970.2221 2978.4908 2984.1004 2985.0759 2985.5994 2988.9125 2991.1115 3004.1296 3037.2452 3052.4838 3056.3156 3071.4923 3076.8157 3086.2591 3086.7933 3088.0615 3092.6976 3096.0981 3096.7704 3120.0717
redmass: 3.2369 3.3124 3.5146 2.5436 2.5525 2.6596 1.8572 1.2597 1.8236 1.3494 1.2159 2.2624 1.3695 2.3241 2.3399 2.9882 2.5402 2.4214 2.1283 3.5973 3.0010 3.2280 2.9036 2.4592 3.3909 4.1438 3.3269 3.3032 1.3599 3.5159 3.4311 2.7051 3.0399 2.9212 2.4323 1.8928 2.8213 1.8161 1.9040 1.5068 1.8650 1.9535 1.8158 1.3334 2.1438 1.3086 1.8920 1.7577 2.5487 2.6517 2.0648 2.1825 1.8200 1.3711 1.8609 2.0690 1.5379 1.3393 1.9311 1.5366 1.9475 1.8421 1.2788 1.3760 1.3921 1.2855 1.3270 1.4456 1.3241 1.5705 1.5520 1.5041 1.4643 1.3397 1.5453 1.2137 1.2179 1.2965 1.0909 1.0553 1.0898 1.0484 1.0833 1.0548 1.0575 1.0568 1.0499 1.0517 1.0460 6.4434 1.0832 1.0812 1.0644 1.0377 1.0793 1.0663 1.0472 1.0793 1.0464 1.0364 1.0427 1.0908 1.0962 1.1021 1.0983 1.0986 1.0986 1.0998 1.0835 1.0993 1.0996 1.0999 1.1000 1.0994
irintensity: 0.0423 0.9317 0.5011 0.3680 0.3144 0.3841 2.8418 1.0599 0.0919 0.2346 0.5977 0.7615 0.3265 1.4665 0.8657 2.5103 1.2138 0.3846 0.0551 4.6226 1.4434 0.4407 1.7062 3.8307 1.2843 1.4320 0.9774 10.8765 48.5640 3.1525 4.7636 2.3825 7.6830 9.9380 26.4915 17.6592 55.2190 3.3754 13.3701 11.6222 6.7913 27.7500 18.4237 12.4922 64.9866 6.4275 0.1570 22.9006 18.4203 8.7574 3.0988 29.5436 3.5917 11.8240 48.7759 32.2331 14.6734 22.1184 32.3551 2.7396 10.6952 38.1527 2.3384 6.1085 18.0957 17.1869 6.5239 0.5648 6.6618 2.4970 3.0217 23.0489 7.6011 34.3403 6.8536 13.5312 21.2459 17.8717 6.1609 4.4212 5.0260 15.5937 10.6861 4.5494 2.7064 6.9539 8.9081 13.5796 12.6633 5.8102 19.2446 69.8721 44.7843 35.8370 7.8654 7.4691 18.6673 27.8822 24.6778 28.3868 35.9010 38.4275 17.9500 21.2383 56.5940 48.8043 27.3293 15.7564 9.7975 24.3116 47.4874 34.5517 30.3738 82.4767
temp: 298.150 k
press: 1.00000 atm
elementType: 8 8 6 6 6 6 6 6 6 6 6 6 6 6 6 6 1 1 1 1 1 1 1 1 1 1 1 1 1 1 1 1 1 1 1 1 1 1 1 1
symmnumber: 1
zpe: 923091.4 jmol-1
zpe.correction: 0.351587 hartree
zpe.thermalcorrener: 0.368918 hartree
zpe.thermalcorrenthalpy: 0.369862 hartree
zpe.thermalcorrgfe: 0.307756 hartree
zpe.sumelectzpe: -697.033531 hartree
zpe.sumelectthermal: -697.016200 hartree
zpe.sumelectthermalent: -697.015256 hartree
zpe.sumelectthermalfe: -697.077361 hartree
dipole: 2.5256 0.9996 0.9940
dipole: 2.8924
quadrupole: -90.7189 -100.1298 -98.4515
quadrupole: 0.6172 -1.2087 1.2799
quadrupole: 5.7145 -3.6964 -2.0181 0.6172 -1.2087 1.2799
hfenergy: -697.3851178 hartree
pointgroup: C01 [X(C14H24O2)]
dipole: -0.9993536 0.3718896 -0.3973697 debye
polarizability: 179.4728929|3.4488818|142.2909021|-4.9336411|-7.2232788|136.8358591 unknown
InChI: InChI=1S/C14H24O2/c1-10-7-5-6-8-12(10)13-15-11(2)9-14(3,4)16-13/h5-6,10-13H,7-9H2,1-4H3
charge 0 multiplicity 1
40 atoms
O  -1.066274 -1.151085 -0.219547
O  -0.514763 1.094117 0.500589
C  1.234211 -0.402426 -0.311973
C  -0.231227 0.025336 -0.461852
C  2.229954 0.766454 -0.580426
C  -2.541729 -0.876795 -0.286981
C  -2.85876 0.329652 0.642312
C  1.48967 -1.030722 1.082722
C  -1.928167 1.538097 0.394827
C  3.681626 0.216218 -0.569419
C  1.956673 1.525813 -1.898137
C  2.962342 -1.276999 1.337876
C  -3.174877 -2.168796 0.251435
C  -2.975233 -0.631291 -1.752662
C  3.952757 -0.732151 0.583608
C  -2.109106 2.660124 1.417105
H  1.406462 -1.182133 -1.084034
H  -0.444828 0.414878 -1.483272
H  2.12522 1.481293 0.260365
H  -2.728227 0.006626 1.69264
H  -3.914548 0.636099 0.506126
H  0.924221 -1.977768 1.163304
H  1.070578 -0.361572 1.861666
H  -2.087956 1.935471 -0.634343
H  4.391216 1.068087 -0.524863
H  3.891535 -0.295705 -1.534999
H  1.014063 2.099921 -1.852407
H  2.771604 2.245426 -2.104121
H  1.900487 0.82997 -2.758474
H  3.220959 -1.937926 2.177611
H  -2.929001 -3.020038 -0.407349
H  -2.783797 -2.389678 1.259418
H  -4.274444 -2.072096 0.308704
H  -2.608058 -1.454208 -2.390276
H  -4.078317 -0.603814 -1.822065
H  -2.591637 0.319461 -2.162244
H  5.002718 -0.970874 0.80515
H  -1.911181 2.28393 2.436383
H  -1.405583 3.485273 1.212015
H  -3.139885 3.057324 1.381387
