program: Gaussian 09
title: 000230199
version: EM64L-G09RevD.01
frameworkgroup: C1[X(C13H22O2)]
method: RPBEPBE
basis: SDD
operation: Freq
keyword: #pfreq=noraman
keyword: PBEPBE/SDD
title: #p freq=noraman PBEPBE/SDD
converged: YES YES NO NO
title: Mulliken charges:
elementType: O O C C C C C C C C C C C C C H H H H H H H H H H H H H H H H H H H H H H
charge: -0.248055 -0.251832 -0.134745 -0.050110 -0.043830 0.284951 -0.485600 -0.471010 -0.362601 -0.370004 -0.780037 -0.209766 -0.210510 -0.699606 -0.735425 0.233027 0.250165 0.217484 0.233396 0.234876 0.206904 0.204279 0.183164 0.228872 0.229097 0.183684 0.228600 0.213731 0.207648 0.198706 0.198460 0.203843 0.203940 0.257928 0.211210 0.219809 0.219359
chargesum: 0.00000
title: Mulliken charges with hydrogens summed into heavy atoms:
elementType: O O C C C C C C C C C C C C C
charge: -0.248055 -0.251832 0.098282 0.200055 0.173654 0.284951 -0.017328 -0.059827 0.049435 0.042777 -0.130057 -0.011061 -0.012050 -0.033896 -0.085047
polarizability: 1.74691732e+02 -4.20374089e+00 1.37426448e+02 7.51099481e-01 1.10789166e+00 1.11126966e+02
1716.lowfreq: -8.7568 -0.0008 -0.0008 -0.0006 9.3939 10.1121 48.6004 54.2498 81.7046
frequency: 48.5372 54.2420 81.6921 125.5839 147.1679 169.5164 185.3035 208.6890 214.8145 218.2726 242.3034 273.4865 300.0677 335.6359 357.8473 381.4017 385.8684 406.6570 413.5125 446.8165 482.8561 494.7821 503.7046 605.4504 656.5306 680.2262 760.9498 765.2590 788.2950 844.5513 879.2060 892.2395 900.7413 916.0198 919.3597 937.9953 940.9186 945.2943 954.4578 960.6508 973.6004 998.9488 1013.3055 1019.8491 1045.8639 1058.6491 1086.7415 1093.7882 1122.0732 1130.9138 1167.9078 1180.4751 1196.8843 1203.0178 1208.2271 1228.1118 1270.1852 1281.3757 1290.5303 1298.4628 1306.2717 1322.7759 1325.9808 1343.3236 1346.9300 1355.7354 1361.0236 1366.0555 1378.0972 1379.1303 1387.1604 1398.9084 1450.1301 1453.6555 1454.8724 1461.8467 1465.9348 1471.3978 1473.7941 1479.0226 1487.4195 1488.3001 1677.6785 2890.6570 2916.8136 2926.9704 2935.7438 2964.9070 2967.0929 2969.9801 2976.5020 2978.0312 2986.6794 3006.3438 3035.8562 3056.1359 3060.0480 3062.8986 3065.6100 3071.3913 3072.1061 3072.4890 3088.1237 3098.9567 3121.1746
redmass: 3.3180 3.4942 3.2956 2.6823 2.4699 1.0561 2.3296 2.2864 3.0887 1.3689 1.4432 2.5080 2.2923 2.4787 2.4742 2.2014 2.2438 1.9014 2.3732 3.3876 5.1772 4.2337 4.2977 6.6269 1.5946 1.9939 3.0313 3.6488 2.9731 2.8052 2.6855 2.1094 2.1564 2.1220 1.9147 1.6151 1.3911 1.7054 2.3103 3.1650 1.2565 2.9253 1.8083 1.4568 2.3372 2.8141 2.5596 2.0334 1.7391 1.3385 1.5323 1.8348 1.6157 1.4079 1.3651 1.4906 2.0475 1.3020 1.4895 1.4120 1.4980 1.1615 1.4894 1.3433 1.5851 1.3719 1.3542 1.5291 1.2255 1.6265 1.2134 1.2112 1.0807 1.0729 1.0901 1.0844 1.0493 1.0749 1.0573 1.0576 1.0475 1.0583 6.4414 1.0820 1.0678 1.0681 1.0647 1.0376 1.0357 1.0756 1.0670 1.0393 1.0878 1.0903 1.0959 1.0982 1.0988 1.0988 1.0977 1.0985 1.0968 1.0966 1.0836 1.0981 1.0994
irintensity: 0.1872 0.4742 0.4050 0.1515 1.5854 0.0709 2.0410 0.5456 4.2092 0.1450 1.3480 2.9761 1.8294 1.3362 0.2904 0.4228 0.4108 2.0596 2.2580 0.4755 4.7463 1.3151 1.0339 6.3731 24.2759 38.3347 4.0016 4.7043 0.3223 19.3387 18.8760 7.6169 37.0474 8.7040 3.1853 6.7115 5.4422 24.9684 1.2126 5.8635 1.2062 81.2598 13.0114 0.8571 66.9872 63.0301 14.7997 23.9392 6.5088 16.4188 15.8744 4.2870 4.3010 2.5172 0.1402 3.2298 0.5683 3.0189 5.4987 8.3381 3.3766 1.6876 0.1575 5.1045 5.7559 10.9265 2.7300 6.2371 25.9574 1.4058 15.0441 24.2085 5.3505 0.4837 5.9991 14.4960 1.1044 17.0020 5.1287 11.1806 3.2895 32.8033 5.3811 49.4804 26.0369 122.3951 42.8774 36.7984 43.9569 5.7851 30.2992 20.2189 25.5068 33.6592 17.5992 54.2408 23.3203 0.1188 0.1348 60.2098 90.7406 30.5007 9.2311 20.1858 79.8328
temp: 298.150 k
press: 1.00000 atm
elementType: 8 8 6 6 6 6 6 6 6 6 6 6 6 6 6 1 1 1 1 1 1 1 1 1 1 1 1 1 1 1 1 1 1 1 1 1 1
symmnumber: 1
zpe: 853271.0 jmol-1
zpe.correction: 0.324994 hartree
zpe.thermalcorrener: 0.340564 hartree
zpe.thermalcorrenthalpy: 0.341508 hartree
zpe.thermalcorrgfe: 0.283233 hartree
zpe.sumelectzpe: -657.798185 hartree
zpe.sumelectthermal: -657.782615 hartree
zpe.sumelectthermalent: -657.781671 hartree
zpe.sumelectthermalfe: -657.839946 hartree
dipole: 2.2088 1.5165 0.2109
dipole: 2.6875
quadrupole: -83.7825 -91.6608 -95.3349
quadrupole: -0.0419 -0.0408 1.4152
quadrupole: 6.4769 -1.4014 -5.0755 -0.0419 -0.0408 1.4152
hfenergy: -658.1231787 hartree
pointgroup: C01 [X(C13H22O2)]
dipole: 0.8749273 -0.5910926 -0.0559273 debye
polarizability: 174.6193202|4.519595|137.553319|-0.5100251|0.1736907|111.0725067 unknown
InChI: InChI=1S/C13H22O2/c1-10-6-4-5-7-11(10)12-14-8-13(2,3)9-15-12/h4-5,10-12H,6-9H2,1-3H3
charge 0 multiplicity 1
37 atoms
O  0.691699 -0.44164 0.920122
O  1.011459 0.483724 -1.288617
C  -1.238775 -0.020036 -0.514907
C  -2.162792 -0.962434 0.31246
C  0.230892 -0.449577 -0.470554
C  3.02029 0.089677 0.158165
C  -1.398576 1.452473 -0.052445
C  -3.64365 -0.554944 0.089907
C  2.10754 -0.84886 0.994865
C  2.437119 0.102566 -1.282024
C  -1.969466 -2.461394 -0.010724
C  -2.852729 1.844964 0.11259
C  -3.869242 0.944186 0.158221
C  3.014846 1.51754 0.752722
C  4.453759 -0.488299 0.125774
H  -1.544839 -0.088916 -1.580396
H  -1.916083 -0.80279 1.38112
H  0.389663 -1.475984 -0.882873
H  -0.903951 2.120083 -0.782433
H  -0.85466 1.591311 0.90462
H  -4.276021 -1.061583 0.84771
H  -3.990488 -0.942129 -0.894246
H  2.208486 -1.896732 0.627927
H  2.367029 -0.814664 2.066349
H  2.944012 0.849208 -1.916142
H  2.550718 -0.90597 -1.743495
H  -0.985747 -2.832042 0.328489
H  -2.743587 -3.067137 0.497368
H  -2.057955 -2.651612 -1.098768
H  -3.07475 2.91879 0.191601
H  -4.906316 1.295431 0.254876
H  3.404911 1.513105 1.787898
H  3.650852 2.194066 0.151223
H  1.990862 1.926407 0.768457
H  4.474461 -1.511605 -0.296607
H  5.119069 0.146549 -0.489015
H  4.882464 -0.531629 1.144581
