program: Gaussian 09
title: 000230187
version: EM64L-G09RevD.01
frameworkgroup: C1[X(C12H20O2)]
method: RPBEPBE
basis: SDD
operation: Freq
keyword: #pfreq=noraman
keyword: PBEPBE/SDD
title: #p freq=noraman PBEPBE/SDD
converged: YES YES NO NO
title: Mulliken charges:
elementType: O O C C C C C C C C C C C C H H H H H H H H H H H H H H H H H H H H
charge: -0.269893 -0.246058 -0.131332 -0.053729 -0.051703 -0.487228 -0.468737 0.045829 -0.779804 -0.393826 -0.208317 -0.212433 -0.332275 -0.718772 0.232781 0.249790 0.217072 0.233528 0.237784 0.206291 0.204083 0.180884 0.226909 0.213502 0.208002 0.198455 0.225836 0.198350 0.198048 0.232234 0.180837 0.233209 0.202973 0.227709
chargesum: 0.00000
title: Mulliken charges with hydrogens summed into heavy atoms:
elementType: O O C C C C C C C C C C C C
charge: -0.269893 -0.246058 0.101450 0.196061 0.165369 -0.015917 -0.058363 0.226714 -0.131391 0.030466 -0.009967 -0.014385 0.080796 -0.054880
polarizability: 1.55581320e+02 5.85429628e+00 1.25094425e+02 -5.07574005e-01 -5.40198075e+00 1.10541079e+02
1716.lowfreq: -17.6561 -0.0008 0.0002 0.0005 8.2426 12.5430 46.2875 71.2517 93.4286
frequency: 45.6728 71.0904 93.3997 125.9732 150.3740 167.5200 200.2800 218.8572 235.6425 258.5811 298.9391 310.2348 352.6585 382.0924 410.0447 417.4713 445.5333 461.7665 489.7664 501.1232 614.4346 639.4673 670.0763 761.0252 775.2690 806.0168 848.4631 855.7805 886.3807 893.2001 905.3864 927.4124 939.8445 951.2034 960.5866 973.6484 979.0465 1015.9833 1028.4385 1058.3544 1080.1470 1086.1937 1095.2543 1120.0101 1129.6368 1145.2763 1150.5566 1177.2911 1204.1515 1205.1694 1224.8742 1227.6292 1283.6664 1288.0972 1295.9187 1300.5596 1303.7262 1326.9806 1339.9534 1346.4370 1352.3341 1357.3987 1365.3850 1370.5892 1379.5932 1384.4623 1389.7970 1435.3332 1455.4644 1459.2046 1461.6229 1466.3715 1474.5997 1479.2817 1488.3514 1678.2991 2892.9649 2906.2964 2932.2828 2937.2021 2965.6762 2972.6897 2980.1070 2986.7143 2989.2827 2993.2034 3007.1822 3036.6959 3056.5199 3062.2684 3071.5249 3084.6358 3087.7338 3089.3197 3097.0687 3120.9088
redmass: 3.2807 3.2877 3.3367 2.5903 2.5556 3.1393 1.2181 1.8097 2.7853 1.4920 2.3451 2.2774 2.4996 2.1168 2.8514 5.2937 3.3353 2.1934 4.0405 3.9972 2.9827 2.9142 1.3312 3.1149 2.7271 2.4791 2.7677 2.9612 1.8591 5.0802 2.1263 2.1764 1.7330 1.8001 1.4387 1.2533 1.6271 1.8499 3.6130 2.6452 2.4888 2.6148 2.0857 1.9302 1.3979 1.8493 1.7062 1.6323 1.2828 1.2937 1.2728 1.4239 1.2865 1.2940 1.2602 1.2763 1.2801 1.4904 1.2441 1.5219 1.4106 1.5558 1.3555 1.5603 1.5946 1.2166 1.3068 1.0941 1.0897 1.0473 1.0855 1.0942 1.0571 1.0501 1.0463 6.4562 1.0824 1.0828 1.0693 1.0641 1.0372 1.0791 1.0661 1.0880 1.0417 1.0544 1.0900 1.0967 1.0981 1.1009 1.0986 1.0956 1.0835 1.0993 1.1002 1.0994
irintensity: 0.0561 0.7523 1.9912 0.5436 0.1173 3.8140 0.4969 1.5952 1.3120 0.4255 3.9328 1.2526 0.4099 0.0568 2.0229 5.0628 1.2413 1.5051 2.1355 0.5772 6.6090 6.2160 50.2402 3.3868 2.9918 3.9014 11.6275 9.0471 9.8129 100.5825 9.7614 27.8632 2.0841 3.6973 17.4192 0.4647 18.7094 7.7547 18.6026 23.0922 73.2105 32.7817 24.6697 14.6809 19.5454 4.0077 21.1776 8.5325 10.4321 2.9101 8.3551 6.5771 5.4543 18.2801 17.5199 0.3367 4.3014 0.6024 13.2462 8.6206 4.7039 8.3707 6.8345 6.4429 2.5391 16.5742 20.6529 9.9395 5.2389 14.3812 11.9760 10.8090 6.5915 6.7274 12.8207 5.7444 33.9547 59.2279 92.4023 44.0019 38.4724 6.9593 12.7604 28.2900 9.9369 45.7920 34.6598 18.3460 54.7787 29.6955 46.8140 32.7566 9.7255 35.2857 29.7378 80.3535
temp: 298.150 k
press: 1.00000 atm
elementType: 8 8 6 6 6 6 6 6 6 6 6 6 6 6 1 1 1 1 1 1 1 1 1 1 1 1 1 1 1 1 1 1 1 1
symmnumber: 1
zpe: 781920.7 jmol-1
zpe.correction: 0.297818 hartree
zpe.thermalcorrener: 0.311896 hartree
zpe.thermalcorrenthalpy: 0.312841 hartree
zpe.thermalcorrgfe: 0.257583 hartree
zpe.sumelectzpe: -618.576973 hartree
zpe.sumelectthermal: -618.562894 hartree
zpe.sumelectthermalent: -618.561950 hartree
zpe.sumelectthermalfe: -618.617207 hartree
dipole: -2.4857 1.1486 -0.8306
dipole: 2.8614
quadrupole: -75.4400 -87.1147 -86.4030
quadrupole: 1.0691 0.8013 -2.0931
quadrupole: 7.5459 -4.1288 -3.4171 1.0691 0.8013 -2.0931
hfenergy: -618.8747908 hartree
pointgroup: C01 [X(C12H20O2)]
dipole: -0.9797416 -0.4676346 0.2979913 debye
polarizability: 155.6249779|-5.6351776|125.3704062|0.9826997|-4.9917906|110.2214401 unknown
InChI: InChI=1S/C12H20O2/c1-9-5-3-4-6-11(9)12-13-8-7-10(2)14-12/h3-4,9-12H,5-8H2,1-2H3
charge 0 multiplicity 1
34 atoms
O  -1.129701 -0.524985 -0.546079
O  -1.208588 1.353395 0.981573
C  0.924194 0.299497 0.484823
C  1.704375 -1.015045 0.182971
C  -0.577773 0.063945 0.676205
C  1.179591 1.357463 -0.620814
C  3.227286 -0.714058 0.157481
C  -2.589797 -0.780229 -0.413002
C  1.403129 -2.158084 1.178408
C  -3.305214 0.545437 -0.066934
C  2.647501 1.467876 -0.977795
C  3.576376 0.545674 -0.612841
C  -2.659867 1.174311 1.183998
C  -3.041794 -1.409703 -1.729393
H  1.29554 0.703804 1.450315
H  1.39991 -1.34726 -0.829641
H  -0.79704 -0.627967 1.525396
H  0.794377 2.337728 -0.283233
H  0.584313 1.092049 -1.518254
H  3.759981 -1.5806 -0.285722
H  3.60697 -0.633484 1.200452
H  -2.734633 -1.4973 0.430332
H  0.369105 -2.532467 1.073831
H  2.082962 -3.01267 1.000459
H  1.550205 -1.827875 2.225815
H  -4.382746 0.360848 0.112746
H  -3.208566 1.24052 -0.921249
H  2.956383 2.349616 -1.557291
H  4.631355 0.696791 -0.88213
H  -3.054785 2.180551 1.396396
H  -2.82927 0.523894 2.072511
H  -2.485781 -2.343133 -1.92291
H  -4.121998 -1.641645 -1.698577
H  -2.853202 -0.716493 -2.567946
