program: Gaussian 09
title: 000230185
version: EM64L-G09RevD.01
frameworkgroup: C1[X(C14H18Br2O4)]
method: RPBEPBE
basis: SDD
operation: Freq
keyword: #p
keyword: freq=noraman
keyword: PBEPBE/SDD
title: #p freq=noraman PBEPBE/SDD
converged: YES YES NO NO
title: Mulliken charges:
elementType: Br Br O O O O C C C C C C C C C C C C C C H H H H H H H H H H H H H H H H H H
charge: -0.043890 0.004513 -0.273159 -0.260901 -0.256515 -0.281219 -0.163866 0.623453 -0.468362 -0.463414 -0.476971 0.194608 0.176309 -0.306108 -0.653413 -0.289242 -0.242764 -0.201914 -0.203959 -0.677234 0.261198 0.301153 0.299436 0.216631 0.235235 0.238635 0.247932 0.250668 0.276348 0.213640 0.197901 0.243205 0.243934 0.188396 0.190509 0.202974 0.228260 0.227996
chargesum: 0.00000
title: Mulliken charges with hydrogens summed into heavy atoms:
elementType: Br Br O O O O C C C C C C C C C C C C C C
charge: -0.043890 0.004513 -0.273159 -0.260901 -0.256515 -0.281219 0.097331 0.623453 -0.167209 -0.163978 -0.476971 0.194608 0.176309 0.145757 0.083822 -0.012894 0.168777 0.285225 0.174946 -0.018004
polarizability: 2.61021404e+02 2.78794934e+01 1.62140697e+02 2.12055792e+01 -7.73236647e-02 1.85592514e+02
1716.lowfreq: -45.3195 -6.1039 -2.1477 -0.0008 -0.0007 -0.0006 4.9250 14.1313 18.4056
frequency: -45.3074 13.7367 18.3679 33.7255 41.1702 46.2598 57.9444 84.4144 96.4256 106.4373 116.2474 125.9463 134.2931 175.9136 184.1246 214.5008 233.9872 236.7823 251.4351 263.0358 277.5621 313.0905 334.3553 348.8528 362.1096 418.4488 438.0218 455.0336 493.7114 518.0427 533.0332 595.0000 646.7357 661.7752 681.3327 720.2330 762.6485 800.9057 809.6837 820.0478 837.5213 839.1565 853.6772 885.0791 891.6385 917.7772 939.8644 977.2121 999.2550 1004.0939 1019.9376 1063.8478 1065.6233 1067.8759 1074.5743 1090.2881 1112.4804 1119.2414 1125.6701 1126.6490 1143.4435 1155.9139 1178.4970 1206.3406 1216.3719 1244.0924 1250.0729 1261.1803 1268.9522 1295.3407 1312.2427 1336.0629 1355.1744 1361.2971 1378.5545 1390.4715 1396.9682 1404.1769 1409.0641 1459.4754 1460.3149 1462.5893 1468.7203 1473.5067 1477.4451 1483.6059 1485.6847 1494.6047 1601.4772 1619.1448 2918.0579 2930.6018 2967.3534 2984.4027 2991.0249 2993.8359 2996.6337 3010.5860 3020.2936 3069.1340 3086.0039 3091.8248 3092.2215 3100.4991 3101.0229 3112.1644 3178.6059 3193.7056
redmass: 2.2634 5.7242 8.0915 7.5809 2.4679 2.9000 4.8573 4.0162 7.5375 4.1106 3.0356 3.0545 11.9267 6.7088 5.1049 3.3822 1.3436 1.1573 6.4061 8.7462 2.7768 4.1680 5.3336 4.0587 5.5391 3.0979 3.7636 3.8554 4.3232 5.5565 5.1833 5.1061 8.9621 7.2862 9.9347 3.9468 6.1358 5.2433 1.1264 1.1344 4.6218 4.2062 1.4140 1.7164 1.8283 3.1874 3.9285 4.9925 3.7210 1.4854 5.1271 1.4558 3.3563 3.4761 5.2927 2.5996 1.7282 1.0369 2.0184 2.2763 1.5830 1.8829 1.2192 1.3238 1.3399 5.9162 1.1473 1.3081 1.1774 1.2947 1.2203 1.3738 1.3055 1.3965 2.5416 1.2388 1.2140 5.7770 1.4412 1.0411 2.8179 1.0849 1.0818 1.0477 1.0693 1.0660 1.2056 1.0790 8.8466 9.2399 1.0556 1.0577 1.1067 1.0926 1.0377 1.0358 1.0736 1.0834 1.0534 1.0880 1.0954 1.0991 1.1020 1.1010 1.1193 1.1003 1.0925 1.0938
irintensity: 14.0713 0.3703 0.2146 0.1767 0.8019 2.1040 1.2855 0.9806 0.5729 0.4077 0.9116 5.4237 0.5787 1.3407 0.5388 1.9534 0.7315 0.7915 1.6141 0.5727 5.4531 5.9494 0.3625 10.1206 1.0808 4.7294 1.4963 17.6261 8.7148 48.8585 16.6046 3.4843 11.3685 7.2532 1.1856 1.3675 2.2845 16.5630 1.0032 4.9948 17.8656 18.6745 15.6241 29.8790 17.6681 7.8091 35.6037 153.8577 15.2613 31.4652 143.6749 3.9523 79.5857 58.4722 128.9046 33.2844 1.2328 0.0103 2.9817 7.7917 5.7277 35.5969 33.2703 15.6383 4.4384 213.1987 0.8232 12.6563 1.7852 9.8316 8.2381 4.4233 14.0543 1.4914 40.6054 16.4233 15.3332 3.3034 11.5254 11.2465 255.8935 32.0045 5.7730 9.6475 11.4818 0.0163 18.7670 6.9551 2.9855 7.2356 45.0863 85.0487 62.4060 21.2450 14.8397 24.5687 50.4216 4.4865 123.2693 1.0123 23.7450 35.3796 27.8605 38.3867 27.0666 16.4850 2.2632 1.1713
temp: 298.150 k
press: 1.00000 atm
elementType: 35 35 8 8 8 8 6 6 6 6 6 6 6 6 6 6 6 6 6 6 1 1 1 1 1 1 1 1 1 1 1 1 1 1 1 1 1 1
symmnumber: 1
zpe: 773538.8 jmol-1
zpe.correction: 0.294625 hartree
zpe.thermalcorrener: 0.316094 hartree
zpe.thermalcorrenthalpy: 0.317038 hartree
zpe.thermalcorrgfe: 0.239175 hartree
zpe.sumelectzpe: -870.510797 hartree
zpe.sumelectthermal: -870.489328 hartree
zpe.sumelectthermalent: -870.488384 hartree
zpe.sumelectthermalfe: -870.566247 hartree
dipole: -2.6137 -1.0736 -0.0160
dipole: 2.8256
quadrupole: -115.2831 -142.1056 -139.6525
quadrupole: -4.4583 10.0658 2.3603
quadrupole: 17.0639 -9.7585 -7.3054 -4.4583 10.0658 2.3603
hfenergy: -870.8054221 hartree
pointgroup: C01 [X(C14H18Br2O4)]
dipole: -0.8755757 0.6409611 -0.2416279 debye
polarizability: 241.6789739|-52.5223267|185.170254|-1.9979401|2.0934763|181.9053867 unknown
InChI: InChI=1S/C14H18Br2O4/c1-3-17-4-5-18-14(9(2)15)10-6-12-13(7-11(10)16)20-8-19-12/h6-7,9,14H,3-5,8H2,1-2H3
charge 0 multiplicity 1
38 atoms
Br 1.577323 -3.608488 1.384299
Br -0.258939 -1.021657 -2.885858
O  1.011648 -0.443126 1.462399
O  -3.682677 1.772164 1.371083
O  -4.292967 2.004139 -0.944127
O  4.102925 1.200316 0.202661
C  0.309782 -1.160482 0.38937
C  -0.904122 -0.343023 -0.073823
C  -0.119797 -2.511471 1.003942
C  -1.68061 0.3043 0.938635
C  -1.288348 -0.183716 -1.427122
C  -2.786664 1.050921 0.546806
C  -3.148265 1.189351 -0.811279
C  1.911478 0.625853 0.990112
C  -1.05378 -3.364616 0.142717
C  -2.414285 0.584899 -1.831589
C  3.287259 0.056223 0.616058
C  -4.662479 2.402183 0.445637
C  5.479536 0.812619 -0.142455
C  6.232566 2.082518 -0.536051
H  0.98147 -1.350514 -0.469785
H  -0.524826 -2.33779 2.015236
H  -1.366206 0.228991 1.982462
H  1.471648 1.171925 0.132297
H  2.013509 1.323813 1.836919
H  -2.015051 -2.837435 -0.005222
H  -0.615308 -3.570521 -0.848146
H  -1.260577 -4.326738 0.639049
H  -2.686326 0.702223 -2.881877
H  3.736352 -0.457685 1.49245
H  3.204287 -0.683249 -0.211632
H  -5.670886 2.016171 0.670794
H  -4.587926 3.499241 0.533492
H  5.462264 0.080915 -0.981092
H  5.95843 0.318238 0.732228
H  7.277851 1.844234 -0.804997
H  5.748252 2.566162 -1.401846
H  6.240161 2.801011 0.301657
