program: Gaussian 09
title: 000230183
version: EM64L-G09RevD.01
frameworkgroup: C1[X(C15H20O3)]
method: RPBEPBE
basis: SDD
operation: Freq
keyword: #pfreq=noraman
keyword: PBEPBE/SDD
title: #p freq=noraman PBEPBE/SDD
converged: YES YES NO NO
title: Mulliken charges:
elementType: O O O C C C C C C C C C C C C C C C H H H H H H H H H H H H H H H H H H H H
charge: -0.275549 -0.252820 -0.268455 0.043491 -0.447410 -0.434751 -0.396699 -0.400168 -0.387820 0.283774 -0.667304 0.450178 -0.390185 -0.366888 -0.350923 -0.347866 0.317926 -0.538363 0.232158 0.205201 0.217221 0.234458 0.200569 0.206059 0.197824 0.200377 0.205585 0.203110 0.190863 0.235638 0.237691 0.234115 0.254848 0.248990 0.239518 0.244001 0.220437 0.221166
chargesum: 0.00000
title: Mulliken charges with hydrogens summed into heavy atoms:
elementType: O O O C C C C C C C C C C C C C C C
charge: -0.275549 -0.252820 -0.268455 0.275650 -0.024988 0.000275 0.007184 0.005793 0.006153 0.283774 -0.193974 0.450178 -0.156069 -0.112040 -0.101933 -0.108348 0.317926 0.147241
polarizability: 2.22050976e+02 -1.81006053e+01 1.42124309e+02 1.31273592e+01 1.01877605e+01 1.47368036e+02
1716.lowfreq: -18.0394 -4.9972 -0.0003 0.0003 0.0006 8.1895 12.6665 17.5999 25.9176
frequency: -12.7301 17.5113 25.0194 61.0086 67.5714 92.9166 104.5325 147.9560 187.0569 211.4412 218.5735 230.3582 268.2777 309.5599 321.8952 327.3015 361.2012 411.4404 414.9851 428.0877 437.4818 458.3805 498.9002 513.0403 536.4235 596.9916 634.0361 684.2160 711.5002 762.6766 786.3520 791.0266 811.2000 820.0703 824.6752 844.1445 864.7916 882.1025 896.3904 921.9709 934.0947 937.5709 953.6200 961.9083 988.8309 999.6824 1004.5180 1045.7260 1052.2037 1081.4613 1093.4702 1110.1008 1111.9018 1121.1076 1152.5325 1155.6386 1179.6310 1197.7152 1204.2566 1227.0095 1231.4056 1240.7474 1252.9392 1258.3649 1284.0475 1300.6995 1307.8590 1310.3688 1331.3034 1337.3883 1338.3569 1349.3667 1360.9216 1384.1435 1418.6440 1436.4060 1453.1300 1462.4247 1463.7648 1466.2109 1466.4843 1472.0800 1472.8277 1480.4580 1502.0198 1586.3753 1620.6975 1627.6871 2957.9283 2969.8819 2972.3596 2973.5390 2986.6475 2988.8379 3010.3375 3014.0460 3033.4586 3036.3613 3044.7698 3044.9133 3056.3826 3064.8313 3094.8759 3123.2555 3129.7607 3137.2212 3163.1232 3167.9148
redmass: 4.1916 3.5201 3.6997 6.1187 4.1748 3.7453 4.4775 4.3834 3.5613 1.9708 1.9223 1.5816 3.4803 3.2776 1.9615 4.3996 3.4959 4.5129 3.2022 2.9134 2.9910 2.0733 3.8850 2.4533 2.4209 4.5079 6.5182 5.4224 3.6004 4.9654 1.9387 1.6261 2.1028 1.5470 3.0648 2.2617 2.4822 1.8798 1.6468 1.7144 2.5961 1.8778 1.9193 1.3842 8.6144 2.8127 2.6997 1.8513 1.0829 1.3310 1.6727 2.6180 1.2608 1.4174 2.3101 1.3433 1.2571 1.5086 2.3798 1.9021 2.8389 1.3183 1.2808 1.2943 1.4678 1.2354 1.3213 1.3719 1.3677 1.5072 1.4631 1.5630 1.4888 5.0783 3.2035 1.1715 1.0970 1.0899 1.0854 1.0502 1.0911 1.0830 1.0730 1.0973 2.4274 7.2013 7.2583 8.4492 1.0330 1.0637 1.0629 1.0631 1.0619 1.0643 1.0824 1.0619 1.0959 1.0982 1.1010 1.1038 1.1021 1.1026 1.1001 1.0992 1.0896 1.0887 1.0946 1.0957
irintensity: 0.5774 0.9304 0.6725 1.2530 1.7410 1.2737 5.2643 1.5658 3.7808 1.5580 2.3152 0.8951 5.8717 1.2893 2.0003 1.1259 3.0949 4.2162 0.7050 1.7869 4.0420 0.5765 9.1120 8.6203 18.6236 11.2082 2.1903 3.3659 5.0409 18.3210 3.0928 2.0826 40.1517 2.1310 1.7306 36.2061 9.7578 0.6719 15.8371 2.8799 16.8097 38.1466 40.5287 5.8443 43.2844 101.0287 3.6713 0.6852 0.1699 19.1590 142.0342 0.7916 0.1440 111.4877 0.9421 0.4753 87.9457 1.5175 4.6491 276.0867 68.0343 1.6700 4.5579 1.8061 42.9628 10.8704 0.5993 19.1533 0.5278 1.0041 0.4941 1.7782 3.5127 15.7307 0.8135 10.8375 16.7319 6.7239 0.9464 12.9399 15.8398 19.6825 56.8522 2.8850 127.4633 4.8421 101.3493 93.3201 68.0173 35.3694 32.3334 33.4024 8.4232 17.9027 19.2483 17.3513 62.4444 61.3904 41.6424 52.6638 22.0367 66.9165 6.3804 28.0767 12.9424 6.9639 13.9186 4.6199
temp: 298.150 k
press: 1.00000 atm
elementType: 8 8 8 6 6 6 6 6 6 6 6 6 6 6 6 6 6 6 1 1 1 1 1 1 1 1 1 1 1 1 1 1 1 1 1 1 1 1
symmnumber: 1
zpe: 838484.2 jmol-1
zpe.correction: 0.319362 hartree
zpe.thermalcorrener: 0.336042 hartree
zpe.thermalcorrenthalpy: 0.336986 hartree
zpe.thermalcorrgfe: 0.273164 hartree
zpe.sumelectzpe: -807.902875 hartree
zpe.sumelectthermal: -807.886196 hartree
zpe.sumelectthermalent: -807.885251 hartree
zpe.sumelectthermalfe: -807.949073 hartree
dipole: 0.5512 0.6830 -0.3046
dipole: 0.9290
quadrupole: -89.6940 -108.4529 -104.1106
quadrupole: 2.5269 10.9961 -3.5649
quadrupole: 11.0585 -7.7004 -3.3581 2.5269 10.9961 -3.5649
hfenergy: -808.2222371 hartree
pointgroup: C01 [X(C15H20O3)]
dipole: -0.2250623 -0.0206392 -0.2872261 debye
polarizability: 221.0091971|-2.1677712|154.9672595|-23.9888559|4.010779|135.5668642 unknown
InChI: InChI=1S/C15H20O3/c1-17-13-9-7-12(8-10-13)11-15(16)18-14-5-3-2-4-6-14/h7-10,14H,2-6,11H2,1H3
charge 0 multiplicity 1
38 atoms
O  -1.705885 -0.075535 0.964089
O  -0.785696 2.071047 1.044255
O  5.119652 -0.669373 -1.015577
C  -2.844328 0.429212 0.117364
C  -3.336567 -0.766573 -0.708113
C  -3.946467 1.008271 1.022088
C  -4.562517 -0.353917 -1.562431
C  -5.171202 1.423738 0.168034
C  -5.690496 0.23993 -0.683376
C  -0.743058 0.854941 1.349817
C  0.369341 0.188588 2.154754
C  1.630847 -0.005828 1.312331
C  2.087275 -1.308229 0.981864
C  2.366175 1.106351 0.837429
C  3.247761 -1.497406 0.208081
C  3.532017 0.935734 0.057806
C  3.975323 -0.373653 -0.255652
C  5.903517 0.458992 -1.52171
H  -2.441581 1.227964 -0.536072
H  -3.619021 -1.586342 -0.018569
H  -2.517926 -1.142184 -1.349264
H  -3.552822 1.874108 1.584358
H  -4.247329 0.233503 1.755075
H  -4.933164 -1.230771 -2.126322
H  -4.2501 0.400361 -2.313785
H  -4.884093 2.26012 -0.50205
H  -5.972006 1.806262 0.828789
H  -6.53493 0.568647 -1.31925
H  -6.082448 -0.55009 -0.00993
H  0.008368 -0.779629 2.535929
H  0.585578 0.848818 3.01472
H  1.528231 -2.18352 1.333116
H  2.015343 2.119014 1.067178
H  3.607774 -2.498564 -0.04764
H  4.076467 1.81738 -0.29364
H  6.737957 0.003868 -2.075347
H  6.299726 1.079234 -0.693916
H  5.30468 1.092832 -2.204732
