program: Gaussian 09
title: 000230170
version: EM64L-G09RevD.01
frameworkgroup: C1[X(C12H16O3)]
method: RPBEPBE
basis: SDD
operation: Freq
keyword: #pfreq=noraman
keyword: PBEPBE/SDD
title: #p freq=noraman PBEPBE/SDD
converged: YES YES NO NO
title: Mulliken charges:
elementType: O O O C C C C C C C C C C C C H H H H H H H H H H H H H H H H
charge: -0.270782 -0.267118 -0.256035 0.033097 -0.656751 0.451963 0.290442 -0.688044 -0.678431 -0.341885 -0.420531 0.317841 -0.348434 -0.349688 -0.538256 0.234228 0.240471 0.234049 0.208240 0.231364 0.223378 0.210464 0.254724 0.220640 0.261018 0.230198 0.249897 0.239104 0.220117 0.219816 0.244907
chargesum: 0.00000
title: Mulliken charges with hydrogens summed into heavy atoms:
elementType: O O O C C C C C C C C C C C C
charge: -0.270782 -0.267118 -0.256035 0.267325 -0.182232 0.451963 0.290442 -0.025063 0.007397 -0.080867 -0.190333 0.317841 -0.098537 -0.110584 0.146584
polarizability: 1.83717407e+02 1.49928394e+01 1.17332381e+02 -9.75186084e+00 1.24716104e+01 1.19438852e+02
1716.lowfreq: -0.0004 0.0004 0.0006 4.4005 5.3845 12.0419 19.6875 22.1054 45.1307
frequency: 16.8909 22.0541 45.0649 71.1520 86.0598 116.7854 155.9153 175.2865 198.0970 211.6014 236.0294 250.4611 283.2741 322.5018 346.5708 375.0777 408.2162 414.7782 417.0408 455.5128 502.1609 520.8373 587.2898 631.2390 681.7497 711.2708 758.1167 766.3127 805.2924 822.5402 844.8027 876.6333 923.7597 927.9970 930.4939 942.0382 947.4105 968.8854 989.5219 1005.2252 1089.0072 1106.0356 1112.7736 1123.2900 1157.2853 1157.7368 1181.8021 1183.9300 1204.2096 1229.6096 1231.1615 1284.2206 1311.1961 1324.1585 1336.4147 1381.7470 1387.1242 1398.7185 1418.5140 1436.6873 1452.2533 1457.7355 1465.3513 1466.6438 1473.9720 1474.2426 1488.1500 1502.0916 1586.1245 1620.5504 1629.5205 2956.7793 2989.9215 2993.2513 3013.4160 3026.9347 3043.6366 3085.0989 3093.4040 3094.7261 3099.0240 3105.6392 3123.0949 3125.4176 3139.4329 3160.7951 3168.2255
redmass: 4.0433 3.6095 3.0562 4.9643 4.3735 4.4206 4.3564 3.2159 1.0246 2.9289 1.1733 1.2178 3.2212 2.7922 4.3527 3.5785 2.6054 3.1029 4.2568 2.4254 3.3815 3.2036 4.5132 6.6870 5.2222 3.5527 3.9448 4.2839 1.7375 1.9490 2.2051 3.0020 2.7198 1.2298 1.7387 1.4176 1.8709 1.3704 8.5485 2.7222 1.9535 1.5138 1.2599 1.4371 1.3351 2.0447 1.2437 1.8613 2.4948 3.8916 1.6326 1.4808 1.3235 1.5066 1.3697 1.2592 4.9240 1.2309 3.2120 1.1725 1.0985 1.0515 1.0475 1.0504 1.0519 1.0770 1.0481 2.3937 7.0688 7.2465 8.4239 1.0331 1.0357 1.0359 1.0619 1.0864 1.1038 1.0993 1.0988 1.1002 1.1006 1.1007 1.0977 1.0908 1.0892 1.0941 1.0962
irintensity: 0.6299 0.4880 0.3049 2.1091 1.6561 5.1820 3.0740 1.6953 0.0251 6.3582 0.2859 1.3462 4.9049 1.0784 1.7028 1.7549 8.3692 1.1417 3.5415 0.9690 9.4602 20.2855 16.6977 0.5554 3.5848 4.7830 12.0482 7.2832 33.1303 5.4780 45.6319 4.5869 46.3756 2.6545 2.6003 1.6968 26.8668 1.4736 39.9956 14.2173 267.0019 11.0695 0.2960 75.4910 3.0595 12.4891 54.0753 16.5044 5.6977 160.2427 157.4488 46.0719 11.5241 10.1725 3.3806 29.3796 6.1530 16.6653 3.4690 11.1644 17.9642 5.9474 3.3116 13.2039 15.1030 50.6510 22.5488 121.2700 9.0204 62.2408 140.3041 68.2482 14.4283 23.5790 17.1542 7.9929 51.0771 5.3388 53.0234 7.4280 24.5294 27.6074 36.5923 3.7734 4.6652 15.3892 3.9911
temp: 298.150 k
press: 1.00000 atm
elementType: 8 8 8 6 6 6 6 6 6 6 6 6 6 6 6 1 1 1 1 1 1 1 1 1 1 1 1 1 1 1 1
symmnumber: 1
zpe: 667773.4 jmol-1
zpe.correction: 0.254341 hartree
zpe.thermalcorrener: 0.270221 hartree
zpe.thermalcorrenthalpy: 0.271165 hartree
zpe.thermalcorrgfe: 0.208845 hartree
zpe.sumelectzpe: -691.405453 hartree
zpe.sumelectthermal: -691.389573 hartree
zpe.sumelectthermalent: -691.388629 hartree
zpe.sumelectthermalfe: -691.450949 hartree
dipole: 0.1505 2.6543 2.0435
dipole: 3.3532
quadrupole: -73.9881 -87.6687 -89.2718
quadrupole: 2.6422 3.4196 -1.2462
quadrupole: 9.6548 -4.0258 -5.6290 2.6422 3.4196 -1.2462
hfenergy: -691.6597941 hartree
pointgroup: C01 [X(C12H16O3)]
dipole: -0.0084286 1.005308 0.8542268 debye
polarizability: 180.9017697|20.3673503|118.7708831|-10.3767187|11.4450112|120.8159878 unknown
InChI: InChI=1S/C12H16O3/c1-9(2)15-12(13)8-10-4-6-11(14-3)7-5-10/h4-7,9H,8H2,1-3H3
charge 0 multiplicity 1
31 atoms
O  -2.838602 -0.141615 0.635674
O  4.099084 0.795026 -0.729068
O  -2.20433 -1.683142 -1.001692
C  -3.959647 0.355392 -0.250313
C  -0.889263 -1.4812 1.08186
C  0.429418 -0.854114 0.626584
C  -2.024122 -1.147295 0.118262
C  -5.015926 0.907902 0.708546
C  -3.388129 1.395165 -1.224109
C  1.026216 -1.237134 -0.605742
C  1.082614 0.117343 1.417509
C  2.888682 0.298355 -0.217354
C  2.241382 -0.67032 -1.02652
C  2.307967 0.697357 1.010698
C  4.810701 1.793668 0.070589
H  -4.33759 -0.520528 -0.810005
H  -0.797243 -2.582753 1.103585
H  -1.154799 -1.128673 2.090951
H  -5.885719 1.278408 0.136257
H  -5.363476 0.125578 1.404749
H  -4.605599 1.745174 1.300057
H  -4.194599 1.788749 -1.869781
H  -2.61842 0.943218 -1.871616
H  -2.941012 2.239677 -0.670521
H  0.52322 -1.976036 -1.239754
H  0.633991 0.431158 2.367742
H  2.708958 -0.959422 -1.972681
H  2.788284 1.444297 1.649795
H  5.098991 1.387466 1.060051
H  4.202228 2.708887 0.209691
H  5.71444 2.034814 -0.508142
