program: Gaussian 09
title: 000230169
version: EM64L-G09RevD.01
frameworkgroup: C1[X(C12H16O3)]
method: RPBEPBE
basis: SDD
operation: Freq
keyword: #pfreq=noraman
keyword: PBEPBE/SDD
title: #p freq=noraman PBEPBE/SDD
converged: YES YES NO NO
title: Mulliken charges:
elementType: O O O C C C C C C C C C C C C H H H H H H H H H H H H H H H H
charge: -0.256878 -0.266931 -0.248536 0.450046 -0.654420 -0.362348 -0.270270 -0.338192 -0.416796 0.280618 0.318294 -0.348307 -0.349281 -0.678645 -0.538474 0.238899 0.235978 0.234068 0.210886 0.228439 0.217370 0.258189 0.230335 0.249833 0.239145 0.218171 0.224978 0.208757 0.219902 0.220284 0.244887
chargesum: 0.00000
title: Mulliken charges with hydrogens summed into heavy atoms:
elementType: O O O C C C C C C C C C C C C
charge: -0.256878 -0.266931 -0.248536 0.450046 -0.179543 0.082606 0.175539 -0.080004 -0.186461 0.280618 0.318294 -0.098475 -0.110136 -0.026738 0.146598
polarizability: 1.94259293e+02 1.13130341e+01 1.20266035e+02 1.23640215e+01 -1.32185023e+01 1.08963288e+02
1716.lowfreq: -6.2643 -3.4877 -0.0004 0.0005 0.0010 8.0207 19.1828 25.0602 30.2438
frequency: 12.4979 23.5364 30.0231 71.7270 75.9358 83.3591 108.4015 157.4512 200.9595 222.6319 235.4199 265.1098 277.1975 310.0408 327.9143 366.9968 407.3387 415.2009 474.2817 500.7848 527.6157 594.9325 631.2250 684.1506 711.0584 747.9930 763.5957 794.3667 810.6780 822.8828 850.2884 882.1689 896.7658 932.4497 940.6217 964.3679 970.3174 990.0868 1004.7905 1047.2031 1092.4526 1113.4858 1119.4601 1124.8628 1157.5570 1161.5026 1183.9041 1205.9827 1228.7644 1230.3758 1247.8388 1284.9571 1290.3729 1307.4099 1313.5858 1366.1721 1387.3565 1393.8971 1419.1387 1437.1842 1451.6768 1454.6183 1466.9306 1473.7713 1476.5785 1480.3011 1487.7052 1502.6268 1586.4873 1622.6518 1635.8276 2956.9960 2978.9158 3000.8513 3014.7210 3020.9501 3043.7398 3049.4545 3075.8344 3083.4188 3095.0271 3103.4551 3123.6870 3126.4601 3139.8969 3161.7858 3168.2619
redmass: 4.1350 3.2171 3.9767 4.5788 3.0423 2.3950 4.6759 4.5618 3.6149 1.1145 1.2123 2.8779 2.8785 3.9242 3.3117 3.4235 4.7206 3.0046 3.9375 3.4750 3.1233 4.8847 6.6243 4.7411 3.5273 2.3785 1.4674 2.5242 2.1458 1.8628 2.1969 1.4981 1.5275 1.5642 2.0195 2.0303 2.0283 8.5008 2.7230 3.0034 1.8607 1.2603 1.6064 1.8329 1.3358 1.6950 1.2282 2.5114 1.6055 3.7292 1.2501 1.4623 1.1184 1.3063 1.3744 1.4073 4.7940 1.2075 3.1888 1.1727 1.0983 1.0977 1.0501 1.0775 1.0518 1.0428 1.0814 2.3868 6.9713 6.6233 8.7615 1.0331 1.0359 1.0603 1.0616 1.0577 1.1038 1.1008 1.1019 1.0990 1.1005 1.1084 1.0981 1.0903 1.0891 1.0940 1.0963
irintensity: 0.8870 0.1839 0.4409 2.3379 0.3668 0.3554 4.8296 2.0682 2.3712 0.3389 0.2236 7.3174 3.8779 11.0746 2.0281 3.2568 5.3288 0.1557 1.8176 8.4529 26.2837 11.6182 0.4902 7.9309 5.4050 5.3687 12.8500 34.3879 14.6989 4.3264 37.7139 4.6699 7.4069 0.7210 4.8743 54.0480 55.9473 34.9023 13.4095 9.8327 160.8379 0.1156 59.1745 34.3278 3.7281 3.1745 56.1899 4.1366 125.4543 181.6958 14.5587 39.6144 8.1981 4.9916 21.3544 2.1800 5.8460 9.9270 3.0656 10.8807 9.0159 19.4060 13.1697 56.7448 4.1552 12.4774 17.1441 122.4711 9.3360 43.2655 144.9587 68.6714 35.0639 11.1187 15.1644 42.8626 51.1823 0.5121 31.3116 42.0303 5.2671 39.4508 35.3857 5.1686 5.6747 15.9457 3.6955
temp: 298.150 k
press: 1.00000 atm
elementType: 8 8 8 6 6 6 6 6 6 6 6 6 6 6 6 1 1 1 1 1 1 1 1 1 1 1 1 1 1 1 1
symmnumber: 1
zpe: 669808.6 jmol-1
zpe.correction: 0.255117 hartree
zpe.thermalcorrener: 0.270989 hartree
zpe.thermalcorrenthalpy: 0.271934 hartree
zpe.thermalcorrgfe: 0.208504 hartree
zpe.sumelectzpe: -691.399086 hartree
zpe.sumelectthermal: -691.383213 hartree
zpe.sumelectthermalent: -691.382269 hartree
zpe.sumelectthermalfe: -691.445699 hartree
dipole: -0.1038 -2.7715 1.3943
dipole: 3.1042
quadrupole: -71.6846 -87.4601 -89.4446
quadrupole: 4.6788 -1.6770 1.4227
quadrupole: 11.1785 -4.5970 -6.5815 4.6788 -1.6770 1.4227
hfenergy: -691.6542028 hartree
pointgroup: C01 [X(C12H16O3)]
dipole: 0.0103259 -1.1016069 -0.5271533 debye
polarizability: 193.5287145|-13.1623377|121.4672073|13.0814354|12.6036261|108.4926939 unknown
InChI: InChI=1S/C12H16O3/c1-3-8-15-12(13)9-10-4-6-11(14-2)7-5-10/h4-7H,3,8-9H2,1-2H3
charge 0 multiplicity 1
31 atoms
O  -2.571472 -0.49447 -0.578596
O  4.399055 -0.175892 0.90216
O  -2.13438 1.549847 0.463333
C  0.601828 0.533972 -0.8584
C  -0.768838 0.828163 -1.469624
C  -4.992566 -0.157616 -0.060502
C  -3.662872 -0.763783 0.409142
C  1.153823 1.393467 0.13053
C  1.346373 -0.598209 -1.257791
C  -1.878809 0.70881 -0.42992
C  3.151639 -0.007915 0.278503
C  2.413637 1.129739 0.694634
C  2.61721 -0.878677 -0.701916
C  -6.141038 -0.516357 0.908866
C  5.196793 -1.33898 0.510233
H  -0.797054 1.863645 -1.85565
H  -0.97701 0.135446 -2.300119
H  -4.883889 0.940538 -0.125955
H  -5.221789 -0.53016 -1.076732
H  -3.36297 -0.350654 1.389266
H  -3.709656 -1.864576 0.455596
H  0.581573 2.265559 0.466531
H  0.934058 -1.277264 -2.013802
H  2.846896 1.785192 1.456296
H  3.167478 -1.762836 -1.037706
H  -5.942163 -0.129444 1.925567
H  -7.094599 -0.078948 0.563881
H  -6.280125 -1.611422 0.982831
H  5.45541 -1.30707 -0.566505
H  4.667717 -2.285743 0.735619
H  6.114441 -1.274865 1.113235
