program: Gaussian 09
title: 000230168
version: EM64L-G09RevD.01
frameworkgroup: C1[X(C15H28O2)]
method: RPBEPBE
basis: SDD
operation: Freq
keyword: #pfreq=noraman
keyword: PBEPBE/SDD
title: #p freq=noraman PBEPBE/SDD
converged: YES YES NO NO
title: Mulliken charges:
elementType: O O C C C C C C C C C C C C C C C H H H H H H H H H H H H H H H H H H H H H H H H H H H H
charge: -0.300397 -0.250750 -0.038753 -0.072336 -0.464250 -0.041200 -0.467546 -0.403654 -0.380771 -0.754896 -0.740939 0.260575 -0.523437 -0.369868 -0.337299 -0.356517 -0.693480 0.186442 0.273600 0.212421 0.206501 0.219643 0.202276 0.225848 0.199565 0.190214 0.199100 0.209962 0.205525 0.209509 0.250875 0.204263 0.211564 0.224014 0.230542 0.242612 0.200536 0.227279 0.187159 0.185075 0.198860 0.196254 0.217067 0.209778 0.209031
chargesum: 0.00000
title: Mulliken charges with hydrogens summed into heavy atoms:
elementType: O O C C C C C C C C C C C C C C C
charge: -0.300397 -0.250750 0.147689 0.201264 -0.045327 0.178444 -0.039423 -0.013875 0.028291 -0.088986 -0.101098 0.260575 -0.050283 0.057947 0.034935 0.038598 -0.057603
polarizability: 1.95738600e+02 -2.54434312e+00 1.57766103e+02 -4.35099357e+00 1.75601519e+00 1.46623975e+02
1716.lowfreq: -12.0867 -2.5896 -0.0005 -0.0005 0.0006 5.9083 14.1506 23.5897 40.5979
frequency: -9.8354 18.1382 40.2277 41.5671 54.8882 80.5994 85.5001 107.2176 119.5264 127.5028 168.9493 182.9538 203.5431 226.3214 228.6941 235.6488 263.7914 272.4945 304.6237 325.6878 366.1685 376.0720 403.0318 427.1908 429.0791 456.6138 489.0111 547.0696 570.0560 622.4463 692.2490 725.7114 753.6818 772.1516 787.8192 835.7860 838.2293 854.4153 869.2549 879.4110 899.9160 912.2875 915.2114 924.3705 953.7571 955.9436 959.1760 996.3446 1011.0770 1050.3599 1058.3007 1061.9351 1075.0874 1078.6360 1090.1049 1099.0915 1113.3605 1127.8671 1135.3227 1150.2411 1154.8638 1171.9120 1198.9351 1205.2718 1235.7202 1239.6360 1255.0902 1257.8178 1269.2951 1285.4285 1290.6364 1300.2941 1304.6577 1311.1420 1318.8231 1324.4670 1333.6144 1339.7976 1343.1290 1347.6715 1355.0957 1359.2743 1370.6204 1380.6029 1388.2426 1398.2190 1443.7820 1453.4008 1460.2392 1465.1072 1466.4172 1468.6539 1470.3438 1475.5169 1476.7098 1480.3146 1480.5759 1483.9907 1488.1229 1499.4097 1629.7604 2927.6284 2952.3155 2960.3160 2967.6149 2969.2215 2970.7763 2971.9796 2974.0035 2974.3435 2980.7705 2985.0375 2986.5687 2987.1581 2994.4938 3022.9281 3027.7200 3037.4256 3043.9737 3046.8264 3048.9962 3053.6952 3056.3917 3065.0479 3066.5287 3070.3056 3071.9319 3074.4844 3080.4114
redmass: 2.7466 6.9482 2.3477 2.4638 2.7536 3.5146 2.7262 1.9002 2.9908 2.3524 2.7562 2.9426 2.1929 1.1465 1.2970 1.7677 2.9049 2.4779 2.3364 2.2591 2.6211 2.5251 2.8765 2.4023 2.5708 2.9807 2.0946 2.9769 3.4940 2.9693 4.5985 1.0868 1.2113 2.0746 2.2694 3.0504 1.3043 1.9559 2.5982 2.6720 1.4499 2.0066 1.3172 2.5447 2.2481 1.2630 1.4886 1.6709 3.9795 1.6592 1.7300 2.8127 2.1568 1.8990 1.8161 1.6337 2.3401 1.6798 2.1411 2.0770 2.2565 1.7628 1.5472 1.5396 1.3623 1.3365 1.2995 1.2674 1.2706 1.0952 1.1148 1.2676 1.3391 1.4652 1.4499 1.3768 1.5834 1.3737 1.4653 1.5531 1.5303 1.6381 1.4524 1.2160 1.2176 1.2043 1.0853 1.0870 1.0835 1.0679 1.0798 1.0619 1.0722 1.0874 1.0427 1.0699 1.0454 1.0566 1.0891 1.0473 9.8665 1.0810 1.0588 1.0633 1.0370 1.0582 1.0413 1.0377 1.0652 1.0629 1.0749 1.0670 1.0619 1.0650 1.0942 1.1017 1.0957 1.0976 1.0980 1.1004 1.0892 1.1013 1.0984 1.0977 1.0996 1.1001 1.0993 1.0988 1.0979
irintensity: 0.1315 1.6488 0.0386 0.0781 0.2444 1.0606 0.1382 0.4936 0.3344 0.3071 2.0514 0.4548 0.7290 0.2549 0.7388 3.5810 7.0984 2.8090 0.0234 0.5966 0.7461 1.1787 6.3267 1.1770 1.4139 0.4304 1.2779 0.7844 6.5960 1.4885 0.3853 13.0001 1.4544 2.2222 7.2715 2.4742 5.4958 25.9231 9.5458 27.0712 4.4050 0.5369 12.3172 9.6385 25.8785 0.7981 1.2048 22.3166 23.0888 1.1737 13.4979 12.5847 30.9971 1.2514 101.3097 0.7471 2.1240 11.2840 103.8354 100.4845 63.1909 9.3753 8.8471 2.3350 0.3132 43.4944 1.5515 13.1500 0.7056 0.7627 1.5258 1.7096 34.2001 3.2468 3.8834 1.6436 3.4261 1.8102 0.3457 15.0433 0.7993 14.6878 1.3643 20.9458 10.8552 19.4733 16.0673 10.0747 7.6998 0.0696 9.5013 6.1087 0.6275 7.6502 12.4993 5.2953 5.7316 4.6847 21.5313 23.1517 153.4679 15.2374 13.5006 44.4121 24.0050 49.0326 29.3124 34.5287 0.6697 23.1391 21.8875 20.8988 38.1443 51.0526 8.7274 16.7209 67.7373 46.6199 10.3485 11.9032 4.8517 103.3281 1.8380 91.4157 1.8839 132.1298 53.5208 30.6899 42.7199
temp: 298.150 k
press: 1.00000 atm
elementType: 8 8 6 6 6 6 6 6 6 6 6 6 6 6 6 6 6 1 1 1 1 1 1 1 1 1 1 1 1 1 1 1 1 1 1 1 1 1 1 1 1 1 1 1 1
symmnumber: 1
zpe: 1056919.9 jmol-1
zpe.correction: 0.402560 hartree
zpe.thermalcorrener: 0.421924 hartree
zpe.thermalcorrenthalpy: 0.422868 hartree
zpe.thermalcorrgfe: 0.353395 hartree
zpe.sumelectzpe: -737.470329 hartree
zpe.sumelectthermal: -737.450964 hartree
zpe.sumelectthermalent: -737.450020 hartree
zpe.sumelectthermalfe: -737.519493 hartree
dipole: 0.6609 -0.2319 -1.7233
dipole: 1.8602
quadrupole: -100.0283 -105.1239 -113.4531
quadrupole: -0.4008 3.8823 -0.1681
quadrupole: 6.1735 1.0778 -7.2513 -0.4008 3.8823 -0.1681
hfenergy: -737.8728881 hartree
pointgroup: C01 [X(C15H28O2)]
dipole: 0.2446132 0.2874218 0.6270562 debye
polarizability: 193.9933382|9.0847538|159.9201361|1.7479008|-0.8315334|146.2152046 unknown
InChI: InChI=1S/C15H28O2/c1-4-5-6-11-15(16)17-14-10-8-7-9-13(14)12(2)3/h12-14H,4-11H2,1-3H3
charge 0 multiplicity 1
45 atoms
O  0.401951 0.663794 -0.136714
O  -0.813779 -0.123697 -1.970954
C  2.784214 0.086204 0.016544
C  1.684683 0.613439 -0.935561
C  3.073922 1.127808 1.132932
C  2.462482 -1.336824 0.577371
C  1.96489 2.027854 -1.47761
C  3.393894 2.530159 0.560578
C  2.254255 3.04175 -0.348568
C  2.131705 -2.351655 -0.547136
C  3.627621 -1.887903 1.437078
C  -0.776907 0.294724 -0.788794
C  -1.978384 0.488946 0.123352
C  -3.111764 -0.525161 -0.146757
C  -4.392608 -0.195976 0.65054
C  -5.523307 -1.226756 0.429907
C  -6.811559 -0.879789 1.207005
H  3.699337 -0.004171 -0.613858
H  1.511556 -0.079503 -1.776911
H  2.186607 1.193661 1.793942
H  3.920935 0.787077 1.755736
H  1.567966 -1.239464 1.226706
H  2.845812 1.959148 -2.149094
H  1.111618 2.352994 -2.102156
H  3.571746 3.242746 1.389171
H  4.335274 2.48049 -0.026524
H  2.515006 4.025521 -0.783752
H  1.338035 3.18354 0.257151
H  2.965008 -2.420005 -1.274167
H  1.979744 -3.360151 -0.119562
H  1.214634 -2.089453 -1.103447
H  4.565977 -1.927011 0.849236
H  3.40252 -2.916078 1.77626
H  3.814663 -1.276992 2.337364
H  -2.357864 1.517395 -0.052927
H  -1.641609 0.456724 1.174433
H  -2.762807 -1.544482 0.113323
H  -3.330965 -0.538141 -1.23101
H  -4.156576 -0.141211 1.734169
H  -4.757141 0.812088 0.360175
H  -5.748922 -1.292783 -0.653797
H  -5.164932 -2.231267 0.734172
H  -7.602209 -1.633725 1.037956
H  -7.210066 0.103824 0.893962
H  -6.617553 -0.83159 2.295333
