program: Gaussian 09
title: 000230165
version: EM64L-G09RevD.01
frameworkgroup: C1[X(C15H28O2)]
method: RPBEPBE
basis: SDD
operation: Freq
keyword: #pfreq=noraman
keyword: PBEPBE/SDD
title: #p freq=noraman PBEPBE/SDD
converged: YES YES NO NO
title: Mulliken charges:
elementType: O O C C C C C C C C C C C C C C C H H H H H H H H H H H H H H H H H H H H H H H H H H H H
charge: -0.283591 -0.245892 0.027377 -0.473300 -0.477563 0.050938 -0.471698 -0.457977 -0.040779 -0.737485 -0.737104 0.242525 -0.527284 -0.367416 -0.337620 -0.355990 -0.694066 0.186196 0.196147 0.217404 0.217267 0.199143 0.230808 0.208585 0.210440 0.233479 0.202765 0.196170 0.206399 0.210772 0.224591 0.206185 0.210162 0.226255 0.234493 0.243586 0.200951 0.223877 0.184579 0.186570 0.198623 0.196019 0.209084 0.209633 0.216743
chargesum: 0.00000
title: Mulliken charges with hydrogens summed into heavy atoms:
elementType: O O C C C C C C C C C C C C C C C
charge: -0.283591 -0.245892 0.213573 -0.059748 -0.061152 0.281746 -0.052672 -0.021733 0.155390 -0.095723 -0.094503 0.242525 -0.049205 0.057412 0.033529 0.038651 -0.058606
polarizability: 2.24583993e+02 -2.99830052e-01 1.47894998e+02 -1.65452542e+00 3.48937282e+00 1.35287322e+02
1716.lowfreq: -12.9311 -6.5081 -0.0012 -0.0006 0.0021 5.0293 19.3519 29.6209 38.4924
frequency: -8.2075 29.4064 38.1051 45.6469 55.1494 57.8592 91.7291 100.3170 126.5518 140.8901 161.2306 176.5996 200.5679 208.8872 213.0274 228.7814 232.2748 250.8124 312.5082 339.4848 366.5158 382.0599 393.4236 414.5581 438.9486 458.6349 467.5645 484.5886 542.7551 603.4573 681.1930 724.4969 752.4904 774.4888 787.3915 837.6234 841.1744 860.2454 868.4885 900.2156 901.2055 912.1900 933.0764 948.8604 950.7944 955.7649 971.4030 996.6263 1013.3823 1035.0549 1059.2560 1064.6318 1075.0730 1083.0278 1094.7738 1101.0804 1114.6997 1117.7243 1144.0899 1162.6534 1172.0830 1177.4086 1198.8369 1217.5825 1232.7710 1243.6865 1246.9606 1255.8749 1273.8077 1287.4636 1287.7577 1290.4598 1297.8039 1310.5057 1310.8209 1315.8463 1326.8570 1329.4984 1340.2954 1351.1148 1352.7270 1362.2960 1369.1961 1377.3384 1391.8223 1395.2502 1441.9126 1458.7606 1462.3825 1465.0383 1467.7518 1469.4533 1470.0945 1474.9440 1477.6810 1478.1034 1480.2921 1483.1967 1488.5691 1493.7491 1632.3579 2924.9689 2948.3476 2952.3381 2960.4382 2968.3226 2969.2473 2969.5494 2972.3150 2972.7534 2975.4086 2985.4354 2987.5807 2988.9042 2994.4546 3010.5009 3023.1443 3040.5946 3042.7223 3046.8284 3051.8893 3059.1374 3060.6999 3065.5268 3066.0533 3070.0015 3071.6278 3074.6316 3078.7814
redmass: 3.1934 3.4298 3.3327 2.2862 2.8556 3.6620 3.4221 1.8868 2.4847 2.7683 1.9125 2.6624 1.7675 1.7612 1.5550 1.9074 1.1443 3.3840 3.4986 3.3148 2.0154 2.8832 2.8751 2.9508 2.4380 3.0961 2.5079 2.3469 2.5584 3.5760 5.2179 1.0854 1.2068 2.3609 1.4718 1.4160 2.0595 3.6622 2.5792 1.7967 1.5030 1.1794 2.8441 2.3150 1.4615 1.2680 2.1795 1.7935 4.0181 2.2538 1.1152 2.7938 2.1737 1.8303 1.7935 2.7370 2.3032 2.2335 2.6734 2.2419 1.8814 2.0285 1.5434 1.3023 1.4633 1.3344 1.2541 1.2690 1.2856 1.0736 1.2969 1.1412 1.2075 1.4036 1.4170 1.2597 1.3842 1.4342 1.5580 1.5691 1.6250 1.6608 1.5400 1.2152 1.2194 1.2054 1.0854 1.0776 1.0890 1.0691 1.0578 1.0797 1.0734 1.0482 1.0969 1.0423 1.0702 1.0612 1.0882 1.0476 9.9548 1.0798 1.0829 1.0590 1.0653 1.0669 1.0585 1.0366 1.0373 1.0371 1.0653 1.0612 1.0634 1.0668 1.0925 1.0830 1.1016 1.0951 1.0974 1.0959 1.1020 1.0987 1.1022 1.0997 1.0980 1.1006 1.0992 1.0987 1.0981
irintensity: 0.0655 0.0798 0.7910 0.0297 0.1492 1.0047 0.9511 0.5860 0.5938 1.6934 0.0620 0.4378 0.3627 0.2185 0.5097 1.4796 0.0742 7.9130 1.1316 6.4276 0.4160 1.5849 0.1887 5.6692 1.7437 0.5709 0.8496 0.1695 0.7789 6.4766 1.6406 13.5525 0.7051 0.2337 0.3941 2.2825 5.6576 7.4282 15.0909 11.0135 6.9450 7.3204 21.0240 10.4606 1.7809 2.1126 2.8663 95.0054 52.2065 3.2319 0.4292 16.9700 25.2272 4.2685 93.7563 0.2870 3.9896 0.8284 292.7039 3.1788 4.9668 5.7284 7.2891 1.3728 3.1608 43.7099 1.4330 13.4517 0.4701 0.0431 0.3037 1.8294 2.4412 4.3680 50.2812 0.4466 4.1408 0.5871 1.3181 10.4703 6.0516 16.5184 0.6564 19.6509 10.6601 17.0596 17.4570 5.4967 10.0794 0.1369 0.1678 17.5142 0.8771 3.0515 2.3668 12.4408 6.0576 6.4003 21.4502 25.0709 156.4983 2.6508 16.7151 14.3688 17.4140 67.1427 48.9260 34.3617 38.5400 30.4999 1.4483 10.2574 25.4363 42.5896 10.3900 19.2049 17.7772 48.9307 9.9700 35.1567 27.6537 1.3898 50.1088 3.1062 104.3875 135.7919 52.8363 44.0830 44.7450
temp: 298.150 k
press: 1.00000 atm
elementType: 8 8 6 6 6 6 6 6 6 6 6 6 6 6 6 6 6 1 1 1 1 1 1 1 1 1 1 1 1 1 1 1 1 1 1 1 1 1 1 1 1 1 1 1 1
symmnumber: 1
zpe: 1055812.5 jmol-1
zpe.correction: 0.402138 hartree
zpe.thermalcorrener: 0.421700 hartree
zpe.thermalcorrenthalpy: 0.422644 hartree
zpe.thermalcorrgfe: 0.353032 hartree
zpe.sumelectzpe: -737.471656 hartree
zpe.sumelectthermal: -737.452094 hartree
zpe.sumelectthermalent: -737.451150 hartree
zpe.sumelectthermalfe: -737.520761 hartree
dipole: 0.9592 -0.8148 -1.3135
dipole: 1.8192
quadrupole: -99.1769 -107.2900 -110.0928
quadrupole: 1.6352 2.9126 -3.2407
quadrupole: 6.3430 -1.7701 -4.5729 1.6352 2.9126 -3.2407
hfenergy: -737.8737937 hartree
pointgroup: C01 [X(C15H28O2)]
dipole: -0.3845158 0.0121509 -0.6035299 debye
polarizability: 224.5817426|1.589535|141.7013864|0.7237253|-7.2017999|141.4831837 unknown
InChI: InChI=1S/C15H28O2/c1-4-5-6-7-15(16)17-14-10-8-13(9-11-14)12(2)3/h12-14H,4-11H2,1-3H3
charge 0 multiplicity 1
45 atoms
O  0.529683 0.435335 -0.627118
O  1.508816 0.210255 1.481502
C  -3.735279 -0.379757 -0.266384
C  -3.235492 1.080053 -0.45511
C  -2.747697 -1.14489 0.657964
C  -0.841559 0.38717 -0.010599
C  -1.771779 1.152364 -0.956429
C  -1.283973 -1.074388 0.157372
C  -5.203188 -0.433097 0.267843
C  -6.190831 0.319369 -0.660244
C  -5.700728 -1.887568 0.467981
C  1.622521 0.340404 0.239251
C  2.928056 0.443941 -0.534316
C  4.110045 -0.240777 0.184206
C  5.452394 -0.01239 -0.543999
C  6.64168 -0.712379 0.152673
C  7.984659 -0.48279 -0.573637
H  -3.724044 -0.876005 -1.264055
H  -3.323782 1.614096 0.515259
H  -3.878883 1.619032 -1.173648
H  -3.038709 -2.207589 0.739445
H  -2.811321 -0.718325 1.681845
H  -0.781311 0.876751 0.9812
H  -1.697504 0.70398 -1.966838
H  -1.442581 2.204871 -1.04058
H  -0.611175 -1.591954 0.86495
H  -1.19921 -1.58277 -0.823847
H  -5.213235 0.071451 1.259559
H  -6.153781 -0.093299 -1.687631
H  -7.22791 0.209486 -0.292344
H  -5.974919 1.40035 -0.719587
H  -5.622109 -2.460658 -0.476695
H  -6.762525 -1.893981 0.776973
H  -5.128259 -2.427001 1.242482
H  3.148884 1.523778 -0.666469
H  2.774126 0.036025 -1.549348
H  3.911471 -1.32809 0.264423
H  4.170225 0.139467 1.221331
H  5.657783 1.077207 -0.607554
H  5.378113 -0.376432 -1.590352
H  6.716187 -0.348102 1.197375
H  6.436245 -1.800397 0.217485
H  7.944723 -0.865829 -1.610991
H  8.229347 0.595121 -0.624004
H  8.817321 -0.994136 -0.056539
