program: Gaussian 09
title: 000230161
version: EM64L-G09RevD.01
frameworkgroup: C1[X(C14H29NO)]
method: RPBEPBE
basis: SDD
operation: Freq
keyword: #p
keyword: freq=noraman
keyword: PBEPBE/SDD
title: #p freq=noraman PBEPBE/SDD
converged: YES YES NO NO
title: Mulliken charges:
elementType: O N C C C C C C C C C C C C C C H H H H H H H H H H H H H H H H H H H H H H H H H H H H H
charge: -0.286703 -0.134475 -0.366599 -0.385410 -0.372570 -0.533017 -0.351823 0.218075 -0.349521 -0.367840 -0.356864 -0.351190 -0.347559 -0.696953 -0.684139 -0.675901 0.183261 0.183334 0.213367 0.223523 0.191685 0.192448 0.224205 0.224719 0.185470 0.185938 0.249363 0.190947 0.226330 0.211061 0.195912 0.195404 0.187486 0.241067 0.209762 0.205011 0.208979 0.215287 0.209145 0.219538 0.203073 0.220232 0.210841 0.210190 0.224910
chargesum: 0.00000
title: Mulliken charges with hydrogens summed into heavy atoms:
elementType: O N C C C C C C C C C C C C C C
charge: -0.286703 -0.134475 -0.000004 0.051480 0.011562 -0.084093 0.019585 0.218075 0.090789 0.069551 0.034452 0.077362 0.067215 -0.063541 -0.041295 -0.029959
polarizability: 2.03620682e+02 8.55592139e-01 1.62072964e+02 1.37411376e+00 4.57159654e+00 1.28809643e+02
1716.lowfreq: -2.3215 -0.0008 0.0005 0.0012 7.4644 10.4935 23.5035 28.3208 33.2148
frequency: 23.0788 28.2745 33.1605 42.9716 56.6975 68.4698 83.6557 87.6309 90.0061 94.6679 113.1227 138.7213 143.1172 151.4773 184.0431 213.3331 226.3018 234.4725 246.3411 253.1012 290.4666 305.2410 341.3569 378.3847 416.7321 421.8905 476.7282 551.7757 574.0676 640.6208 720.9256 728.6603 742.8539 746.4393 764.8109 792.5041 831.3590 862.8460 868.1066 886.1053 889.2320 890.7822 910.0438 974.3014 994.6801 1005.9447 1030.7941 1045.8226 1050.7865 1058.1512 1080.8525 1085.2594 1091.9328 1102.8883 1104.1550 1111.4992 1117.2009 1147.2390 1188.9459 1209.8472 1212.7257 1228.5807 1232.4806 1262.2495 1267.1071 1273.0125 1281.1990 1289.9537 1293.2476 1296.4621 1297.9418 1301.5082 1305.4166 1313.2245 1340.7122 1355.1028 1356.7576 1359.0126 1363.7597 1388.3000 1389.8665 1391.3514 1411.0406 1439.9607 1451.3001 1459.3984 1461.4937 1466.5478 1472.7640 1473.3235 1474.2990 1477.3822 1477.7986 1479.6112 1480.3897 1482.2909 1486.1531 1487.6992 1491.7909 1581.7920 2944.4620 2950.1542 2956.5951 2958.6387 2968.0989 2970.7830 2973.2884 2974.9337 2979.1144 2981.9852 2983.5790 2991.3985 2992.3513 2993.0378 2999.6181 3008.1021 3014.5987 3031.4474 3034.5346 3039.9518 3058.8519 3063.4710 3064.2404 3067.7044 3069.6887 3074.6850 3076.9150 3079.6275 3079.9376
redmass: 3.6569 1.8047 2.9915 3.1863 3.4064 3.7184 1.8526 2.1080 1.7400 2.4903 2.4372 2.0366 3.0348 2.1065 3.2872 1.2765 1.1382 1.1149 2.6186 2.7601 2.9336 3.2683 3.3635 2.6235 3.5889 3.6179 3.2018 2.9916 3.4490 3.7339 1.0647 1.1008 1.0980 1.1177 1.1888 4.1373 1.2871 1.3544 1.3240 1.7069 1.8245 1.7593 1.2928 3.5228 1.1926 3.6065 3.1978 3.0077 2.9076 2.9237 2.1381 2.3832 1.6353 1.6567 1.7677 2.2223 2.3817 2.0832 1.7120 2.4023 1.4277 1.4065 1.3865 1.3868 1.3589 1.2244 1.0349 1.1797 1.0872 1.1602 1.3146 1.2932 1.2799 1.3325 1.4818 1.5888 1.5852 1.4448 1.3806 1.2182 1.2106 1.2088 2.4056 1.1035 1.1242 1.0736 1.0696 1.0779 1.0599 1.0677 1.0773 1.0448 1.0426 1.0487 1.0856 1.0830 1.0713 1.0888 1.1029 6.4910 1.0589 1.0588 1.0603 1.0591 1.0579 1.0372 1.0364 1.0368 1.0625 1.0636 1.0972 1.0619 1.0995 1.0632 1.0616 1.0974 1.1033 1.0978 1.1046 1.0949 1.0988 1.1003 1.1033 1.1008 1.0992 1.1017 1.0995 1.1019 1.0999
irintensity: 0.1429 0.0135 0.5380 0.4234 0.8291 1.8687 0.0751 0.5068 0.3895 0.0844 0.9921 0.3533 2.0633 1.0069 0.5539 0.0621 0.1126 0.0004 0.1738 0.5344 1.7310 0.0906 12.6771 1.0877 6.2449 7.3110 2.4436 2.4559 3.7550 3.7486 14.8981 0.0840 6.4589 14.5285 4.6899 0.9568 0.1994 0.3602 2.4947 21.1743 5.8595 2.5657 2.3706 1.6302 0.0161 0.1121 17.8470 0.6739 0.0085 5.7613 1.9057 4.5061 18.7498 2.9196 4.0441 3.7616 0.5436 69.3474 0.2698 18.8548 4.3610 37.1950 14.8272 1.5247 11.5376 0.2108 0.1334 17.6911 1.0694 1.1952 3.2666 0.0449 1.5464 18.0888 3.3361 0.8691 2.3074 0.9224 5.5105 10.9745 14.5062 13.2179 120.3924 26.7581 14.3377 0.2642 0.2699 1.6409 2.1110 4.3075 2.1645 11.8960 12.2247 12.2746 1.9605 5.4808 17.0338 23.7716 17.3273 244.3359 7.2370 4.4825 13.4889 32.7735 110.9927 34.0995 41.6351 28.6117 4.6681 24.5325 4.0006 63.3699 2.4608 39.4127 29.5319 12.5611 0.3422 3.5510 73.0208 2.3315 3.3632 9.4490 45.5383 120.4122 56.3446 85.4559 47.8859 57.0168 52.8897
temp: 298.150 k
press: 1.00000 atm
elementType: 8 7 6 6 6 6 6 6 6 6 6 6 6 6 6 6 1 1 1 1 1 1 1 1 1 1 1 1 1 1 1 1 1 1 1 1 1 1 1 1 1 1 1 1 1
symmnumber: 1
zpe: 1068753.8 jmol-1
zpe.correction: 0.407067 hartree
zpe.thermalcorrener: 0.428498 hartree
zpe.thermalcorrenthalpy: 0.429442 hartree
zpe.thermalcorrgfe: 0.353545 hartree
zpe.sumelectzpe: -679.540441 hartree
zpe.sumelectthermal: -679.519010 hartree
zpe.sumelectthermalent: -679.518066 hartree
zpe.sumelectthermalfe: -679.593963 hartree
dipole: 1.4333 3.5304 1.3283
dipole: 4.0351
quadrupole: -94.5972 -106.7591 -102.7316
quadrupole: 5.2897 1.6763 -3.0832
quadrupole: 6.7655 -5.3965 -1.3690 5.2897 1.6763 -3.0832
hfenergy: -679.9475079 hartree
pointgroup: C01 [X(C14H29N1O1)]
dipole: 0.5368569 -1.408878 -0.4971172 debye
polarizability: 203.5721488|-1.6881203|162.2771384|-1.2373346|3.9930144|128.6540021 unknown
InChI: InChI=1S/C14H29NO/c1-4-7-8-9-10-11-14(16)15(12-5-2)13-6-3/h4-13H2,1-3H3
charge 0 multiplicity 1
45 atoms
O  1.246053 1.762721 0.655111
N  2.494433 -0.089878 0.027099
C  -2.564502 -0.150178 -0.224949
C  -1.277196 0.59706 0.186849
C  -3.853067 0.62018 0.142308
C  -0.001412 -0.176453 -0.201031
C  -5.147083 -0.128413 -0.2489
C  1.281383 0.57521 0.194905
C  3.739923 0.623269 0.400117
C  2.631593 -1.461623 -0.504425
C  -6.43572 0.646903 0.109154
C  4.315481 1.474158 -0.756449
C  2.738964 -2.546659 0.596848
C  -7.723644 -0.112947 -0.27608
C  5.632185 2.170845 -0.352845
C  2.951387 -3.954499 0.000753
H  -2.552751 -0.336788 -1.320126
H  -2.587637 -1.149364 0.260142
H  -1.276299 0.777025 1.278793
H  -1.250075 1.59837 -0.281478
H  -3.860823 0.819996 1.234233
H  -3.838626 1.613005 -0.35369
H  -0.013051 -1.180862 0.268548
H  0.002728 -0.349416 -1.298146
H  -5.165483 -1.118234 0.254115
H  -5.13735 -0.335127 -1.339992
H  3.511265 1.283793 1.254926
H  4.485333 -0.127262 0.728647
H  1.780211 -1.693354 -1.16782
H  3.540586 -1.495998 -1.137997
H  -6.4200 1.632829 -0.398757
H  -6.441677 0.85919 1.197901
H  4.485091 0.830701 -1.643376
H  3.557937 2.227673 -1.039732
H  1.819594 -2.528824 1.21379
H  3.576397 -2.293425 1.275768
H  -7.77726 -1.088971 0.242519
H  -8.629858 0.461739 -0.00939
H  -7.756581 -0.3103 -1.364457
H  5.476607 2.834095 0.518496
H  6.412295 1.433806 -0.081538
H  6.026119 2.789109 -1.179461
H  2.116435 -4.236509 -0.668362
H  3.885866 -4.00277 -0.589797
H  3.016832 -4.718322 0.795978
