program: Gaussian 09
title: 000230155
version: EM64L-G09RevD.01
frameworkgroup: C1[X(C14H16Br2O4)]
method: RPBEPBE
basis: SDD
operation: Freq
keyword: #p
keyword: freq=noraman
keyword: PBEPBE/SDD
title: #p freq=noraman PBEPBE/SDD
converged: YES YES NO NO
title: Mulliken charges:
elementType: Br Br O O O O C C C C C C C C C C C C C C H H H H H H H H H H H H H H H H
charge: -0.036481 0.031431 -0.297522 -0.261661 -0.255535 -0.221657 -0.172586 0.603866 -0.448387 -0.449489 -0.474468 0.189747 -0.190790 0.174291 -0.658421 0.288907 -0.288716 -0.688526 -0.681661 -0.202975 0.323720 0.312166 0.293799 0.232931 0.238132 0.256997 0.247211 0.276643 0.215775 0.238845 0.220197 0.220520 0.246992 0.229728 0.241471 0.245508
chargesum: 0.00000
title: Mulliken charges with hydrogens summed into heavy atoms:
elementType: Br Br O O O O C C C C C C C C C C C C C C
charge: -0.036481 0.031431 -0.297522 -0.261661 -0.255535 -0.221657 0.151135 0.603866 -0.136221 -0.155690 -0.474468 0.189747 0.042141 0.174291 0.083918 0.288907 -0.012074 -0.013708 0.015579 0.284003
polarizability: 2.55576826e+02 2.42621997e+01 1.97328223e+02 8.86406826e+00 2.32353126e+01 1.47133777e+02
1716.lowfreq: -6.1373 -5.0895 0.0002 0.0007 0.0009 2.5996 12.1232 26.0942 29.5313
frequency: 11.8580 26.0752 29.4620 38.2481 39.4679 47.8841 58.1799 87.2425 99.4279 131.3054 150.4103 167.7960 188.3622 199.2540 214.1329 227.7867 241.9192 246.9716 267.2627 276.8255 287.6809 304.9007 305.9144 338.0656 365.9944 429.2302 444.6911 510.3335 517.7493 582.6946 593.8965 644.6998 646.4674 666.7488 680.0234 706.5782 717.2855 765.4206 796.9337 820.6343 836.5493 854.9912 870.2878 890.9861 900.7444 928.0093 940.7346 950.2801 964.7355 976.9990 1003.4606 1063.9238 1066.7672 1069.4348 1076.7235 1098.7564 1112.5755 1122.9999 1136.2848 1146.4613 1176.4094 1198.4616 1216.5409 1251.5121 1270.2069 1293.6176 1315.6500 1327.9116 1342.9609 1361.0976 1379.0121 1383.8799 1390.6496 1397.2290 1407.1105 1460.7565 1463.9035 1465.2765 1472.0761 1475.0399 1477.1751 1485.3471 1490.3937 1603.0465 1621.0366 1656.1507 2986.3884 2989.5213 2991.0396 3015.2059 3025.7646 3042.5601 3075.3198 3085.2674 3087.6949 3088.5713 3092.5736 3098.8401 3109.1096 3121.5681 3187.2609 3194.3837
redmass: 3.5927 9.2085 4.9355 5.2655 5.7373 2.7088 5.6715 4.4932 8.2254 7.8402 6.6590 9.0575 2.5163 1.2438 2.9058 2.3159 1.3150 1.9150 3.7881 5.2213 3.1264 4.7312 3.9682 6.3342 4.3403 3.2443 3.8241 4.9340 5.2361 5.8780 4.6772 7.4335 3.6738 6.2794 9.6595 6.0526 4.4317 6.0073 5.3424 4.5433 7.7666 1.4493 3.7824 1.9693 1.7610 1.1847 2.9927 3.8885 1.4498 4.6484 1.4874 2.9618 1.4960 2.1873 3.5483 1.5837 2.4494 1.0490 2.4967 2.0730 1.8477 1.2501 1.3368 6.0397 1.4209 1.3300 1.4625 1.4491 1.7150 1.3524 1.2158 2.4273 1.2180 1.2179 5.7915 2.8752 1.0463 1.0634 1.0482 1.0511 1.0476 1.2186 1.0590 8.8827 9.2989 9.8062 1.0342 1.0354 1.0389 1.0571 1.0848 1.0841 1.0871 1.1004 1.0938 1.1009 1.1008 1.0998 1.1151 1.1010 1.0924 1.0938
irintensity: 0.2855 0.0430 0.4914 1.6017 0.6303 10.7036 3.2705 0.6542 0.6164 0.6924 1.3995 0.2940 0.5702 0.4196 0.3910 1.5645 0.5374 2.1192 1.1170 3.0511 2.0869 3.2515 12.7611 1.5487 4.0435 16.2779 1.5783 19.7431 44.0998 1.8886 5.6342 4.6412 3.9901 10.3577 0.7055 4.2874 2.6276 0.8339 22.1841 8.8079 28.3057 16.2809 18.3854 29.7829 12.2966 6.4187 50.2034 59.4870 1.5679 129.6466 35.4647 205.7535 7.4942 141.8735 240.8285 15.4858 9.8301 0.5309 5.9690 8.1864 2.9150 48.4274 3.9583 187.9573 3.4713 4.9462 7.5519 23.8584 34.5406 0.3916 7.5622 49.0740 30.5646 25.7544 0.9493 245.0395 5.5739 16.8927 1.1951 6.0231 15.3487 20.7721 26.5383 2.9729 6.1544 132.5585 25.1353 28.0789 12.7096 120.8760 7.7775 3.0307 1.2791 24.1651 21.5905 13.6025 29.8448 36.1110 26.4926 13.3386 1.4779 1.1934
temp: 298.150 k
press: 1.00000 atm
elementType: 35 35 8 8 8 8 6 6 6 6 6 6 6 6 6 6 6 6 6 6 1 1 1 1 1 1 1 1 1 1 1 1 1 1 1 1
symmnumber: 1
zpe: 714535.7 jmol-1
zpe.correction: 0.272152 hartree
zpe.thermalcorrener: 0.293844 hartree
zpe.thermalcorrenthalpy: 0.294788 hartree
zpe.thermalcorrgfe: 0.216367 hartree
zpe.sumelectzpe: -869.384497 hartree
zpe.sumelectthermal: -869.362806 hartree
zpe.sumelectthermalent: -869.361862 hartree
zpe.sumelectthermalfe: -869.440282 hartree
dipole: 2.9387 2.8671 2.5133
dipole: 4.8138
quadrupole: -124.9565 -129.1211 -141.4081
quadrupole: -0.4572 2.7006 1.3194
quadrupole: 6.8721 2.7075 -9.5795 -0.4572 2.7006 1.3194
hfenergy: -869.6566496 hartree
pointgroup: C01 [X(C14H16Br2O4)]
dipole: 1.1448679 0.6895679 1.3418477 debye
polarizability: 256.0722431|14.0618981|176.3907517|21.8259977|33.1958499|167.5758308 unknown
InChI: InChI=1S/C14H16Br2O4/c1-7(2)14(17)20-13(8(3)15)9-4-11-12(5-10(9)16)19-6-18-11/h4-5,7-8,13H,6H2,1-3H3
charge 0 multiplicity 1
36 atoms
Br -3.526655 -2.209822 0.017482
Br 0.681767 -2.623979 -2.360384
O  -1.611826 0.449661 0.284385
O  3.261284 0.981215 1.875013
O  4.691819 -0.305455 0.433616
O  -1.711076 1.356288 -1.869327
C  -0.985285 -0.778647 -0.263126
C  0.536568 -0.688481 -0.136074
C  -1.548526 -1.978616 0.529414
C  1.104702 0.16312 0.859876
C  1.405169 -1.43807 -0.967972
C  2.491501 0.223374 0.9598
C  -2.742692 2.565415 0.035586
C  3.33423 -0.531109 0.115824
C  -1.439415 -1.888407 2.052471
C  -1.971619 1.446002 -0.65212
C  2.820743 -1.378794 -0.865649
C  -2.390756 3.93332 -0.589694
C  -4.262737 2.251616 -0.087346
C  4.678012 0.760203 1.476911
H  -1.265953 -0.867736 -1.327812
H  -1.096078 -2.902516 0.133181
H  0.450445 0.755618 1.502554
H  -2.470757 2.551525 1.106866
H  -0.373824 -1.827135 2.345199
H  -1.959889 -0.994521 2.431669
H  -1.875914 -2.783419 2.52455
H  3.470432 -1.960746 -1.52153
H  -2.999249 4.728878 -0.123808
H  -2.593915 3.92377 -1.674509
H  -1.324417 4.184205 -0.446401
H  -4.844925 3.023086 0.447425
H  -4.505515 1.264878 0.344606
H  -4.572067 2.254913 -1.147926
H  5.080061 1.692045 1.040319
H  5.246554 0.409319 2.352328
