program: Gaussian 09
title: 000230152
version: EM64L-G09RevD.01
frameworkgroup: C1[X(C14H19ClO2)]
method: RPBEPBE
basis: SDD
operation: Freq
keyword: #p
keyword: freq=noraman
keyword: PBEPBE/SDD
title: #p freq=noraman PBEPBE/SDD
converged: YES YES NO NO
title: Mulliken charges:
elementType: Cl O O C C C C C C C C C C C C C C H H H H H H H H H H H H H H H H H H H
charge: -0.056686 -0.288831 -0.215387 -0.372492 -0.365164 -0.351112 -0.370305 -0.356434 -0.522360 -0.695484 0.203888 0.370980 -0.299446 -0.385140 -0.191698 -0.180274 -0.117641 0.192491 0.192611 0.190559 0.189804 0.187534 0.187431 0.214908 0.219747 0.195825 0.195756 0.252622 0.250968 0.209664 0.216473 0.209725 0.308169 0.262664 0.257323 0.259314
chargesum: 0.00000
title: Mulliken charges with hydrogens summed into heavy atoms:
elementType: Cl O O C C C C C C C C C C C C C C
charge: -0.056686 -0.288831 -0.215387 0.012611 0.015199 0.023853 0.064350 0.035147 -0.018771 -0.059622 0.203888 0.370980 0.008722 -0.122477 0.065625 0.079040 -0.117641
polarizability: 2.68426014e+02 1.48783694e-01 1.50591798e+02 -8.64386242e-01 -6.36809786e-01 9.66078852e+01
1716.lowfreq: -41.0316 -6.8649 -2.1315 -0.0015 0.0014 0.0016 8.4249 11.4180 27.2110
frequency: -34.7726 10.3745 27.1720 37.5185 43.8371 59.7835 81.7759 91.1370 124.9492 129.2719 150.7103 156.9487 166.1498 230.0902 241.7713 278.0199 316.4067 331.8943 358.6022 409.6771 414.0023 420.7890 480.5656 499.1246 534.8897 612.9574 629.4627 698.3265 699.9967 719.6278 725.6082 757.8351 768.6024 820.5261 822.6988 837.0258 886.6609 890.6831 905.8768 950.8775 972.1100 993.4324 994.6354 1000.2426 1028.5777 1052.8780 1066.8592 1078.0424 1082.5489 1091.9577 1107.6088 1112.5611 1122.5387 1155.4478 1187.9516 1189.8531 1222.0576 1227.9090 1266.7236 1268.9896 1280.6339 1287.1747 1292.0443 1294.4523 1311.0381 1343.3366 1353.7510 1361.8408 1370.5332 1387.5457 1397.4279 1435.3484 1461.1168 1461.6973 1465.0619 1467.3374 1474.7327 1477.2956 1482.5775 1487.4933 1581.3819 1599.1722 1654.7361 2950.3776 2951.1832 2959.4204 2968.0144 2971.9167 2983.5295 2985.6330 2994.2845 2995.5554 3014.4625 3028.7619 3036.0670 3061.5563 3068.4558 3071.3053 3161.7147 3167.9255 3181.2319 3213.1428
redmass: 1.7795 5.7208 5.3541 6.4316 4.8154 1.6396 3.4227 4.2981 1.9607 2.3464 5.1251 5.6421 5.0536 1.1140 5.4256 6.4759 4.5518 6.8985 4.9823 4.0591 3.0244 4.6126 3.3654 2.8346 2.8307 7.1143 7.3879 6.1218 4.0812 1.0672 1.1067 1.1959 7.2382 1.2878 1.2841 1.4439 3.1220 2.8301 1.2739 1.3405 1.3245 1.1839 4.3723 4.4964 3.1712 3.6162 2.5663 2.1758 2.4588 2.4450 1.3506 1.4773 2.8853 1.9891 1.6992 1.6949 1.3215 1.3727 1.2483 1.3171 1.0384 1.2521 1.1063 1.1029 1.4166 1.5316 1.6655 1.7096 7.0703 1.2165 3.5184 1.0857 1.0762 1.0672 2.2323 1.0945 1.0769 1.0442 1.0828 1.0902 7.2612 7.0976 10.1566 1.0588 1.0586 1.0591 1.0587 1.0364 1.0618 1.0969 1.0627 1.0967 1.1028 1.0994 1.1036 1.1032 1.1008 1.0993 1.0888 1.0919 1.0978 1.0948
irintensity: 0.0109 0.0208 0.0848 1.6148 0.0692 0.2990 0.4785 0.2547 0.0688 0.0261 2.1381 0.6313 2.4919 0.0037 1.5487 2.5081 9.1645 2.4313 4.7949 9.4376 0.0626 0.4393 1.2115 23.3448 0.2194 3.0965 13.1462 7.1054 1.6114 16.7811 0.0074 5.2802 13.1367 9.8186 2.4917 79.7258 8.5862 28.3937 2.5676 1.7917 1.6959 0.0369 55.3971 28.7877 76.1011 66.3011 185.7783 23.2773 3.8775 188.6287 30.9972 8.5621 117.5312 118.0599 0.0714 122.9406 33.2608 0.8098 6.2822 19.9741 0.1641 2.8533 0.2668 0.2151 21.9735 16.9574 0.8405 7.8482 8.9231 11.6303 7.1139 26.3725 1.2304 0.2179 199.5491 2.2418 1.9337 12.0923 4.3479 25.9587 3.9876 0.0758 162.8148 1.2421 4.2738 21.8143 112.2184 37.5982 6.9065 1.1091 35.0777 4.6518 0.8298 10.2777 62.5146 62.7945 104.6091 54.2307 2.3080 2.0734 1.9678 5.1700
temp: 298.150 k
press: 1.00000 atm
elementType: 17 8 8 6 6 6 6 6 6 6 6 6 6 6 6 6 6 1 1 1 1 1 1 1 1 1 1 1 1 1 1 1 1 1 1 1
symmnumber: 1
zpe: 777796.5 jmol-1
zpe.correction: 0.296247 hartree
zpe.thermalcorrener: 0.314339 hartree
zpe.thermalcorrenthalpy: 0.315283 hartree
zpe.thermalcorrgfe: 0.246094 hartree
zpe.sumelectzpe: -1154.104643 hartree
zpe.sumelectthermal: -1154.086551 hartree
zpe.sumelectthermalent: -1154.085607 hartree
zpe.sumelectthermalfe: -1154.154796 hartree
dipole: -2.6385 1.8344 0.0462
dipole: 3.2138
quadrupole: -119.9609 -106.9626 -110.6845
quadrupole: 1.7883 0.0161 -0.4128
quadrupole: -7.4249 5.5734 1.8515 1.7883 0.0161 -0.4128
hfenergy: -1154.4008902 hartree
pointgroup: C01 [X(C14H19Cl1O2)]
dipole: 1.0441757 0.3206921 -0.6368402 debye
polarizability: 268.3829657|-2.7339966|109.8596382|-0.1595259|-23.2182746|137.3830925 unknown
InChI: InChI=1S/C14H19ClO2/c1-2-3-4-5-6-7-14(16)17-13-10-8-12(15)9-11-13/h8-11H,2-7H2,1H3
charge 0 multiplicity 1
36 atoms
Cl -7.365428 0.009164 0.227802
O  -1.391755 0.354031 -0.579682
O  -0.477104 -0.712426 1.314232
C  4.796433 -0.197124 0.472632
C  3.540869 0.147477 -0.359684
C  6.119205 0.082181 -0.275862
C  2.222314 -0.148754 0.388087
C  7.37668 -0.258418 0.556234
C  0.98594 0.213137 -0.457338
C  8.69332 0.016217 -0.202238
C  -0.327289 -0.118992 0.227843
C  -2.779834 0.210945 -0.279661
C  -3.321392 -0.446673 0.851287
C  -3.61979 0.802578 -1.251144
C  -4.727101 -0.503601 0.996426
C  -5.019878 0.743931 -1.102086
C  -5.554496 0.088521 0.025352
H  4.780512 0.383635 1.418405
H  4.760121 -1.267332 0.764985
H  3.575016 1.220391 -0.643763
H  3.564467 -0.427034 -1.309603
H  6.156174 1.151802 -0.571659
H  6.137711 -0.501735 -1.220026
H  2.195973 0.415068 1.340479
H  2.178217 -1.219465 0.66441
H  7.360916 0.328776 1.49713
H  7.336926 -1.3257 0.855808
H  0.977826 1.289839 -0.71547
H  1.003688 -0.322797 -1.427782
H  8.771704 1.082555 -0.487034
H  9.576343 -0.23454 0.413904
H  8.747792 -0.583006 -1.130773
H  -2.670659 -0.899617 1.599008
H  -3.16745 1.301584 -2.112806
H  -5.163999 -1.00707 1.86344
H  -5.678268 1.198351 -1.847351
