program: Gaussian 09
title: 000230139
version: EM64L-G09RevD.01
frameworkgroup: C1[X(C13H14Br2O4)]
method: RPBEPBE
basis: SDD
operation: Freq
keyword: #p
keyword: freq=noraman
keyword: PBEPBE/SDD
title: #p freq=noraman PBEPBE/SDD
converged: YES YES NO NO
title: Mulliken charges:
elementType: Br Br O O O O C C C C C C C C C C C C C H H H H H H H H H H H H H H
charge: -0.030173 0.032203 -0.296268 -0.261794 -0.255510 -0.224495 -0.172720 0.600835 -0.447683 -0.451379 0.191722 -0.473355 0.175220 -0.658439 -0.288327 -0.202825 0.309297 -0.493085 -0.658928 0.324080 0.311979 0.292693 0.237378 0.257125 0.247061 0.276792 0.241498 0.245697 0.254332 0.237964 0.234451 0.216282 0.228371
chargesum: 0.00000
title: Mulliken charges with hydrogens summed into heavy atoms:
elementType: Br Br O O O O C C C C C C C C C C C C C
charge: -0.030173 0.032203 -0.296268 -0.261794 -0.255510 -0.224495 0.151361 0.600835 -0.135705 -0.158686 0.191722 -0.473355 0.175220 0.083125 -0.011535 0.284369 0.309297 -0.000789 0.020177
polarizability: 2.45657816e+02 1.96189224e+01 1.82239461e+02 1.25792040e+01 2.26344405e+01 1.38159992e+02
1716.lowfreq: -7.6396 0.0002 0.0004 0.0005 1.6938 5.2969 18.5661 24.3328 33.9607
frequency: 18.1113 24.3286 33.8571 36.5169 44.8883 55.3687 58.3242 86.9796 99.4190 135.2713 152.8663 170.3831 179.2262 204.6346 221.2302 234.3590 263.4659 269.5137 276.3118 297.5840 314.2294 348.6861 418.0546 433.9358 501.9409 509.4128 546.4162 583.4146 592.4029 644.5419 645.2252 667.5340 680.2875 716.1342 768.0485 792.5978 801.3748 834.7316 844.7551 856.3265 871.7315 896.2084 930.6665 947.8802 976.8436 1002.2734 1015.4035 1065.2367 1065.6891 1066.9266 1076.9826 1086.2095 1109.4784 1122.6527 1139.3232 1147.9518 1198.9156 1218.4085 1243.3726 1252.1657 1272.6143 1317.3283 1327.0576 1341.0649 1361.0491 1384.3256 1388.9863 1399.3997 1407.2390 1442.9580 1460.4261 1462.3935 1471.2737 1473.7157 1480.9937 1485.1843 1603.5726 1621.2228 1664.7201 2989.7412 2996.2890 3000.7749 3015.6134 3042.3599 3042.9101 3072.9722 3087.0614 3097.8042 3104.2819 3108.9813 3121.3667 3187.5665 3195.0644
redmass: 5.5415 7.8605 2.6448 6.5816 2.7885 3.1785 4.7603 4.4812 8.1418 9.1426 6.6944 4.6198 1.5268 4.2499 1.6368 1.8947 5.6817 3.9798 8.4019 4.4613 5.8801 7.1977 4.0583 3.9360 3.9159 5.2344 3.1897 5.7890 4.9062 4.2418 8.1451 6.4370 9.6584 4.3447 6.1155 1.3512 5.5415 7.4484 4.3532 1.4373 3.5167 1.4904 2.7245 4.8485 4.6793 1.4432 1.9516 2.2288 1.9389 1.9994 2.7871 1.6174 2.6377 1.0498 2.5974 2.0686 1.2515 1.3392 1.1753 5.9660 1.4181 1.4988 1.4518 1.8071 1.3507 2.4982 1.2186 1.2114 5.9147 1.0838 1.4065 1.7081 1.0390 1.0506 1.0512 1.2329 8.8441 9.2895 9.7886 1.0391 1.0577 1.0392 1.0570 1.0841 1.0987 1.0872 1.0938 1.1004 1.1004 1.1152 1.1011 1.0925 1.0938
irintensity: 0.2658 0.2239 0.0163 1.2497 11.0308 3.1981 2.5128 0.6976 0.6523 0.9022 1.1225 0.1356 0.3921 0.6222 1.1187 1.0786 2.1841 3.0606 4.3151 3.4943 14.1444 4.0656 6.5861 10.4302 17.7393 27.7717 21.0723 1.6899 6.2474 3.4118 5.5197 10.0643 0.6876 1.0545 0.8616 13.4684 24.3532 26.6952 8.7568 15.2282 21.4196 28.6595 59.4708 48.0978 132.6501 17.3443 90.4351 67.0872 97.3189 67.4319 109.9136 0.9709 189.5221 0.6350 23.1335 9.4681 50.5883 4.5559 0.4747 184.9707 4.2923 8.6929 25.3856 53.6120 0.3276 43.6477 27.3222 18.1827 1.0942 28.6952 103.5937 151.9649 13.8476 5.7446 15.3992 23.8422 2.6423 6.1561 139.1624 14.0535 26.0368 16.5311 120.6546 3.6147 3.5338 1.3349 20.3962 27.8788 26.8208 26.2716 13.1174 1.4628 1.1775
temp: 298.150 k
press: 1.00000 atm
elementType: 35 35 8 8 8 8 6 6 6 6 6 6 6 6 6 6 6 6 6 1 1 1 1 1 1 1 1 1 1 1 1 1 1
symmnumber: 1
zpe: 641349.9 jmol-1
zpe.correction: 0.244277 hartree
zpe.thermalcorrener: 0.264631 hartree
zpe.thermalcorrenthalpy: 0.265575 hartree
zpe.thermalcorrgfe: 0.190135 hartree
zpe.sumelectzpe: -830.160476 hartree
zpe.sumelectthermal: -830.140122 hartree
zpe.sumelectthermalent: -830.139178 hartree
zpe.sumelectthermalfe: -830.214618 hartree
dipole: 3.5317 2.6650 2.4229
dipole: 5.0443
quadrupole: -120.6926 -121.3079 -135.0998
quadrupole: -0.0468 1.9626 0.8371
quadrupole: 5.0075 4.3922 -9.3997 -0.0468 1.9626 0.8371
hfenergy: -830.4047531 hartree
pointgroup: C01 [X(C13H14Br2O4)]
dipole: -1.3997796 -0.661591 1.2415855 debye
polarizability: 246.0663992|13.4129648|163.1980117|-18.5806016|-31.1570445|156.7928569 unknown
InChI: InChI=1S/C13H14Br2O4/c1-3-12(16)19-13(7(2)14)8-4-10-11(5-9(8)15)18-6-17-10/h4-5,7,13H,3,6H2,1-2H3
charge 0 multiplicity 1
33 atoms
Br 3.893716 1.876654 0.315954
Br -0.090078 2.568267 -2.364459
O  1.813652 -0.658597 0.406509
O  -3.191214 -0.930972 1.600725
O  -4.429833 0.454557 0.076329
O  2.111283 -1.534594 -1.743258
C  1.302701 0.605698 -0.175262
C  -0.227479 0.602653 -0.165301
C  1.872365 1.767131 0.668745
C  -0.919397 -0.226725 0.769148
C  -2.311016 -0.208061 0.760197
C  -0.984987 1.41137 -1.048993
C  -3.041252 0.604602 -0.132865
C  1.63676 1.674489 2.177357
C  -2.405328 1.433395 -1.057022
C  -4.558308 -0.623588 1.098627
C  2.216816 -1.659931 -0.5074
C  2.779328 -2.848943 0.251069
C  3.197533 -4.003603 -0.676046
H  1.666596 0.684116 -1.215397
H  1.508373 2.718398 0.247045
H  -0.35233 -0.86216 1.452367
H  0.549407 1.677665 2.383912
H  2.069736 0.747157 2.585147
H  2.088645 2.537084 2.693233
H  -2.967632 2.060418 -1.750926
H  -4.977725 -1.524962 0.616716
H  -5.172472 -0.251775 1.933653
H  3.636225 -2.485576 0.85055
H  2.018896 -3.177042 0.985759
H  3.971478 -3.675881 -1.390477
H  3.601396 -4.842478 -0.082579
H  2.339846 -4.371866 -1.264455
