program: Gaussian 09
title: 000230136
version: EM64L-G09RevD.01
frameworkgroup: C1[X(C13H19NO2)]
method: RPBEPBE
basis: SDD
operation: Freq
keyword: #p
keyword: freq=noraman
keyword: PBEPBE/SDD
title: #p freq=noraman PBEPBE/SDD
converged: NO YES NO NO
title: Mulliken charges:
elementType: O O N C C C C C C C C C C C C C H H H H H H H H H H H H H H H H H H H
charge: -0.323046 -0.285701 -0.256648 -0.349704 -0.431106 -0.325459 0.437803 -0.695515 0.282694 -0.344939 -0.357099 -0.224794 -0.233479 -0.252955 -0.249081 -0.663622 0.267051 0.209789 0.223674 0.196091 0.195282 0.210675 0.213158 0.216630 0.205291 0.281899 0.230553 0.225406 0.224416 0.228632 0.238962 0.218252 0.215128 0.221476 0.250288
chargesum: 0.00000
title: Mulliken charges with hydrogens summed into heavy atoms:
elementType: O O N C C C C C C C C C C C C C
charge: -0.323046 -0.285701 -0.256648 0.070061 0.045734 0.080497 0.437803 -0.060436 0.282694 -0.063040 -0.126547 0.000612 -0.009064 -0.024323 0.208133 0.023270
polarizability: 2.04555821e+02 -2.13815049e+00 1.30646406e+02 -3.20209974e+00 -1.98912440e+01 1.28055439e+02
1716.lowfreq: -9.1159 -4.1546 -0.0007 -0.0005 0.0003 9.8554 21.4593 34.8900 36.7292
frequency: 21.2659 34.8573 36.5408 45.9547 61.9171 78.9282 93.9382 119.3002 167.3636 198.5196 219.0103 233.4969 246.9124 296.5748 303.7976 351.0598 373.6694 403.9495 408.4767 437.9077 492.3485 512.2760 567.1972 614.9729 635.2729 690.9225 691.6074 717.9576 744.4129 762.9269 793.4206 813.2290 819.6782 831.1361 869.7053 902.3528 918.1638 955.1025 965.2743 985.3743 987.8501 992.4030 1025.7945 1036.3654 1054.0330 1084.5606 1094.3909 1108.0565 1116.4559 1126.4055 1153.5580 1174.5096 1197.4269 1214.0368 1218.9047 1244.0442 1281.3202 1285.4771 1302.5279 1326.5896 1333.8434 1358.3636 1365.2120 1369.7463 1383.0035 1388.2920 1390.5335 1443.0484 1455.3005 1461.0043 1461.6730 1472.1271 1478.2247 1483.5758 1485.6865 1487.2421 1499.3586 1589.0838 1608.3418 1629.2859 2970.2067 2972.8033 2977.8764 2990.4115 3010.9735 3015.1610 3030.1098 3040.2419 3069.6921 3072.8200 3084.8664 3091.0699 3116.5711 3122.5963 3127.1081 3137.4253 3156.8182 3168.9341 3201.0878
redmass: 3.7002 2.9774 3.5120 3.8083 1.6296 4.6359 5.2279 3.2170 2.2654 3.0364 1.4207 1.2193 2.3814 5.6104 2.7148 4.1063 4.0688 2.8918 3.0842 2.9224 2.7765 3.9853 3.5015 6.1819 4.1448 2.8765 3.4955 2.6431 1.3392 1.8048 1.9073 1.6311 2.0397 1.3342 1.4620 1.4550 2.2646 1.4994 1.3899 2.2049 2.0617 2.4350 3.3045 2.4277 2.7621 2.1240 2.1207 2.3676 2.1920 1.9020 1.6874 1.0515 1.2978 2.6850 1.5107 1.4387 1.1122 1.1963 1.3100 1.3964 1.4911 1.4954 1.3018 1.8142 5.9140 1.2406 1.2200 2.2950 1.1081 1.0747 1.0610 1.0663 1.0425 1.0514 1.0724 2.1321 1.1123 6.1073 6.2097 9.1939 1.0526 1.0431 1.0608 1.0360 1.0726 1.0957 1.0590 1.1025 1.1010 1.0993 1.0980 1.1028 1.1062 1.0922 1.0849 1.0900 1.0943 1.0981 1.0943
irintensity: 0.1393 0.0598 0.7307 0.8749 0.0300 3.8807 0.1643 1.1006 0.6602 0.1992 2.0862 0.0419 0.1402 3.8187 7.7078 14.0592 1.4567 2.6312 0.4405 4.5131 10.4950 3.9556 10.3166 1.0776 1.4430 50.5746 5.2533 29.5604 11.6853 64.8649 6.5538 1.6312 0.2322 0.0082 1.1165 4.9899 4.4321 41.2795 3.1354 0.2795 0.2015 0.7798 126.4110 44.1059 30.5810 65.6664 49.8452 49.4697 93.2511 63.4216 28.0170 0.5025 9.7730 95.6268 112.1973 24.7804 5.5326 25.7170 32.0185 32.4701 130.6485 1.0228 27.4812 91.7080 7.5700 25.5667 7.8340 10.7606 30.9836 10.0458 7.3549 11.9484 12.9364 23.2864 8.7310 103.6787 15.8789 5.9821 99.4571 237.1039 8.6703 34.2139 53.5276 21.4494 48.4726 6.7951 40.3198 26.6075 78.5689 46.7870 40.6660 4.9453 33.5134 7.0630 0.9629 15.9177 38.1733 15.0441 1.3968
temp: 298.150 k
press: 1.00000 atm
elementType: 8 8 7 6 6 6 6 6 6 6 6 6 6 6 6 6 1 1 1 1 1 1 1 1 1 1 1 1 1 1 1 1 1 1 1
symmnumber: 1
zpe: 777221.0 jmol-1
zpe.correction: 0.296028 hartree
zpe.thermalcorrener: 0.313079 hartree
zpe.thermalcorrenthalpy: 0.314023 hartree
zpe.thermalcorrgfe: 0.248745 hartree
zpe.sumelectzpe: -710.764387 hartree
zpe.sumelectthermal: -710.747335 hartree
zpe.sumelectthermalent: -710.746391 hartree
zpe.sumelectthermalfe: -710.811670 hartree
dipole: 0.9559 2.1925 -0.8049
dipole: 2.5236
quadrupole: -82.8754 -102.1075 -92.8999
quadrupole: -2.1333 -0.1335 -3.3145
quadrupole: 9.7522 -9.4799 -0.2723 -2.1333 -0.1335 -3.3145
hfenergy: -711.0604145 hartree
pointgroup: C01 [X(C13H19N1O2)]
dipole: -0.3566616 -0.8376766 -0.3960495 debye
polarizability: 204.6442538|-0.4345249|126.7873228|2.2536385|19.8467524|131.8260888 unknown
InChI: InChI=1S/C13H19NO2/c1-3-5-11-14(13(15)16-4-2)12-9-7-6-8-10-12/h6-10H,3-5,11H2,1-2H3
charge 0 multiplicity 1
35 atoms
O  -2.488723 0.584481 -0.745227
O  -1.157797 2.023354 0.531389
N  -0.205652 0.198232 -0.65102
C  -0.144325 -2.322137 -0.931056
C  -0.466618 -0.951784 -1.569935
C  -1.016596 -2.647356 0.30208
C  1.155087 0.449127 -0.229935
C  -0.701236 -4.036723 0.895767
C  -1.252071 1.015345 -0.218224
C  1.454492 1.035479 1.030684
C  2.231312 0.071788 -1.078713
C  2.79577 1.240619 1.416586
C  3.56898 0.280353 -0.680613
C  3.863933 0.866334 0.569972
C  -3.673862 1.37352 -0.302334
C  -4.206368 0.858673 1.037882
H  -1.529057 -0.909819 -1.844886
H  0.115758 -0.812158 -2.499865
H  0.925812 -2.369884 -0.649794
H  -0.301278 -3.096803 -1.709748
H  -2.08686 -2.592453 0.018209
H  -0.857734 -1.869669 1.07474
H  0.358173 -4.102347 1.207791
H  -1.32732 -4.24857 1.781819
H  -0.882777 -4.83828 0.154569
H  0.644499 1.350589 1.689354
H  2.038641 -0.374571 -2.058239
H  3.00294 1.696392 2.391406
H  4.37972 -0.014621 -1.356337
H  4.902382 1.028501 0.877833
H  -3.384788 2.436676 -0.235699
H  -4.398251 1.225878 -1.119865
H  -5.136883 1.395498 1.301451
H  -4.433374 -0.220472 0.984371
H  -3.47023 1.032311 1.840488
