program: Gaussian 09
title: 000230109
version: EM64L-G09RevD.01
frameworkgroup: C1[X(C17H10BrNO4)]
method: RPBEPBE
basis: SDD
operation: Freq
keyword: #p
keyword: freq=noraman
keyword: PBEPBE/SDD
title: #p freq=noraman PBEPBE/SDD
converged: NO YES NO NO
title: Mulliken charges:
elementType: Br O O O O N C C C C C C C C C C C C C C C C C H H H H H H H H H H
charge: 0.038116 -0.140434 -0.244928 -0.415352 -0.242489 -0.478889 0.291539 0.260610 0.279438 0.220608 -0.313008 -0.537129 -0.376167 0.707799 -0.392506 -0.414685 -0.563677 -0.217293 -0.229590 0.233723 -0.291142 -0.207755 0.169078 0.358966 0.266127 0.247462 0.282364 0.233742 0.238903 0.310144 0.250059 0.292153 0.384217
chargesum: 0.00000
title: Mulliken charges with hydrogens summed into heavy atoms:
elementType: Br O O O O N C C C C C C C C C C C C C C C C C
charge: 0.038116 -0.140434 -0.244928 -0.031134 -0.242489 -0.168746 0.291539 0.260610 0.279438 0.220608 -0.313008 -0.178163 -0.110040 0.707799 -0.145044 -0.132322 -0.563677 0.016450 0.009312 0.233723 -0.041083 0.084398 0.169078
polarizability: 5.01626723e+02 5.07623068e+00 2.56711555e+02 5.30064266e-03 -5.40479655e-03 7.92138274e+01
1716.lowfreq: -3.2783 -1.6306 -0.0011 -0.0005 0.0009 3.0732 22.1715 35.8803 40.2797
frequency: 22.1593 35.8795 40.2764 50.9749 69.0953 98.8084 105.7397 125.8355 139.4747 154.4657 171.2645 176.6195 211.5978 223.2620 248.5076 248.5785 271.4949 291.7611 368.4843 390.8363 424.7610 431.0225 441.3729 489.7527 500.5330 529.3068 573.3602 574.4775 589.6444 606.3290 619.1475 653.4803 653.9500 681.5513 718.5932 720.0329 723.1996 736.0304 755.9573 773.7519 780.5582 838.2690 846.4364 885.3909 902.5791 911.5657 920.5994 966.6004 970.3689 977.8409 978.0116 996.3057 999.3985 999.9295 1029.7012 1058.8779 1079.0769 1112.4391 1152.3840 1167.6062 1186.8376 1198.3312 1220.0730 1234.5122 1270.2683 1296.6283 1308.5311 1327.8607 1346.5788 1382.5395 1431.4312 1439.8469 1447.1333 1478.9709 1500.5648 1577.3087 1597.8821 1601.5647 1602.5208 1618.6184 1630.0841 1637.4722 1661.3651 3112.5293 3131.4022 3143.4161 3154.3013 3162.3504 3168.9933 3169.7019 3179.0381 3467.8771 3520.5328
redmass: 7.8055 8.9593 9.8514 9.5317 6.8562 5.9695 9.5123 10.7123 5.7872 4.6615 7.5432 3.1078 5.7028 20.3548 8.7525 4.4163 8.1755 10.5405 4.5076 8.1149 4.0904 6.4896 3.0887 4.2515 5.0950 6.2532 1.6799 6.8249 6.4195 7.1356 4.0765 1.9632 7.5288 1.4533 3.9124 7.1711 6.0398 4.9378 1.6797 6.3968 2.4044 3.1923 7.4961 1.4789 1.5911 2.1791 5.4999 1.4007 4.3576 1.5371 4.1293 1.0888 1.3659 5.0624 2.1139 2.1842 2.6722 2.1936 2.2104 1.2920 2.0637 2.4859 1.4553 1.3109 2.1820 1.9264 1.7741 2.5077 4.8769 4.2724 5.6096 2.5600 2.7266 4.6295 2.2837 8.6132 7.4544 6.0853 5.1315 7.7490 8.7163 10.8072 6.1583 1.0924 1.0866 1.0900 1.0947 1.0931 1.0927 1.1003 1.0936 1.0764 1.0641
irintensity: 1.6202 0.1066 0.2137 0.1999 0.6330 11.6380 0.8544 3.6466 0.1273 0.0631 0.3387 0.0544 0.3015 0.3506 4.9106 0.3776 2.0156 6.7441 0.0183 15.8600 6.0831 19.3272 6.5226 14.7807 29.4361 2.5756 66.3146 28.0593 30.3907 7.9180 0.0001 95.9332 5.0312 15.8789 8.6754 5.3126 4.2417 92.3997 30.4524 33.6808 42.2566 0.6523 33.3068 12.4294 0.0868 2.9543 10.9173 2.2965 10.7331 31.5915 56.1128 62.4967 0.4476 9.8560 3.3351 476.0750 12.6826 31.5665 31.1753 9.8889 34.5233 7.2941 52.0742 13.8643 1.0996 19.6481 55.7002 232.7082 170.5392 44.6713 29.8884 20.4937 78.6066 28.2431 437.1106 77.0085 77.8536 11.4034 150.3085 92.0159 229.3738 86.6305 58.8933 2.2088 2.8501 4.7723 11.8314 1.7405 3.2150 36.4439 16.3980 61.1291 71.9544
temp: 298.150 k
press: 1.00000 atm
elementType: 35 8 8 8 8 7 6 6 6 6 6 6 6 6 6 6 6 6 6 6 6 6 6 1 1 1 1 1 1 1 1 1 1
symmnumber: 1
zpe: 600659.2 jmol-1
zpe.correction: 0.228779 hartree
zpe.thermalcorrener: 0.248430 hartree
zpe.thermalcorrenthalpy: 0.249374 hartree
zpe.thermalcorrgfe: 0.177815 hartree
zpe.sumelectzpe: -1021.364063 hartree
zpe.sumelectthermal: -1021.344412 hartree
zpe.sumelectthermalent: -1021.343468 hartree
zpe.sumelectthermalfe: -1021.415026 hartree
dipole: 2.1499 4.3254 0.0000
dipole: 4.8302
quadrupole: -103.2407 -152.0978 -144.3980
quadrupole: 11.0557 -0.0003 0.0017
quadrupole: 30.0047 -18.8523 -11.1525 11.0557 -0.0003 0.0017
hfenergy: -1021.5928419 hartree
pointgroup: C01 [X(C17H10Br1N1O4)]
dipole: 0.8872859 1.6804778 0.0005368 debye
polarizability: 501.728347|-0.9319504|256.6099183|0.0118613|0.0483595|79.2138407 unknown
InChI: InChI=1S/C17H10BrNO4/c18-13-7-11-9-3-1-2-4-10(9)17(23)12(11)8-14(13)19-15(20)5-6-16(21)22/h1-8,19,21H
charge 0 multiplicity 1
33 atoms
Br -0.797641 3.630681 0.001576
O  2.233539 -2.886323 -0.000309
O  -2.586678 -1.54699 -0.000056
O  -7.653609 -1.394761 0.000143
O  -7.1792 0.886869 0.000543
N  -2.008382 0.741567 0.000618
C  2.253632 0.718607 0.00046
C  1.521823 -0.504524 0.000057
C  3.705831 0.409733 0.000479
C  3.860284 -1.009954 0.000081
C  2.500272 -1.654179 -0.000605
C  0.125703 -0.547702 0.000121
C  1.561309 1.941051 0.000893
C  -0.599186 0.685664 0.000564
C  4.837994 1.242964 0.000946
C  5.12725 -1.612485 0.000206
C  0.15057 1.903741 0.000927
C  6.122854 0.636848 0.001033
C  6.270363 -0.772099 0.00068
C  -2.921986 -0.324175 0.000395
C  -4.342623 0.13315 0.000448
C  -5.367443 -0.762696 0.000154
C  -6.775362 -0.30248 0.000213
H  -0.423035 -1.492126 -0.000218
H  2.081892 2.902398 0.001256
H  4.746182 2.334586 0.001294
H  5.219513 -2.703474 -0.000133
H  7.016475 1.270811 0.001412
H  7.2734 -1.211323 0.000756
H  -2.405895 1.687544 0.000884
H  -4.573438 1.207935 0.000718
H  -5.169661 -1.839503 -0.00013
H  -8.592447 -1.062954 0.000296
