program: Gaussian 09
title: 000230106
version: EM64L-G09RevD.01
frameworkgroup: C1[X(C17H16Cl3N)]
method: RPBEPBE
basis: SDD
operation: Freq
keyword: #p
keyword: freq=noraman
keyword: PBEPBE/SDD
title: #p freq=noraman PBEPBE/SDD
converged: YES YES NO NO
title: Mulliken charges:
elementType: Cl Cl Cl N C C C C C C C C C C C C C C C C C H H H H H H H H H H H H H H H H
charge: -0.077496 -0.056108 -0.054430 -0.182626 0.393101 -0.777687 0.189901 0.374489 0.194775 0.483346 -0.579614 -0.427569 -0.381687 -0.409855 -0.397781 -0.389476 -0.390462 -0.238328 -0.226928 -0.586650 -0.585923 0.300218 0.262373 0.241804 0.234836 0.250290 0.250556 0.250442 0.251676 0.256326 0.240989 0.229634 0.227687 0.269318 0.292624 0.267568 0.300667
chargesum: 0.00000
title: Mulliken charges with hydrogens summed into heavy atoms:
elementType: Cl Cl Cl N C C C C C C C C C C C C C C C C C
charge: -0.077496 -0.056108 -0.054430 -0.182626 0.393101 -0.477470 0.189901 0.374489 0.194775 0.483346 -0.317241 -0.185764 -0.146851 -0.153529 -0.156792 0.111370 0.111656 -0.008694 0.000759 -0.024708 -0.017688
polarizability: 3.70065331e+02 1.04567129e+01 2.46229469e+02 -5.79026595e+00 1.97625899e+01 1.16462842e+02
1716.lowfreq: -4.5254 0.0035 0.0036 0.0039 1.7412 5.4720 21.5564 28.2008 32.3237
frequency: 21.5303 28.1533 32.3198 37.6037 66.7073 84.6664 103.7239 110.4829 124.6213 148.6381 155.0234 193.9947 210.8572 214.0390 241.6637 276.7071 298.0522 309.9462 349.4733 380.5522 425.3473 441.8729 466.6594 492.9106 505.9090 551.6795 555.1175 580.0473 594.3517 650.3785 668.0568 670.5670 698.5805 705.1029 744.0322 755.2430 770.0732 781.9422 784.0690 789.3603 815.7315 843.2977 865.0335 882.2679 891.3547 943.8385 950.9559 965.8646 986.9873 996.2594 998.6462 1024.6589 1033.4748 1035.7321 1044.5197 1095.3450 1118.2240 1127.9669 1155.0151 1158.7945 1167.9840 1177.3139 1199.0275 1208.6153 1219.3496 1245.9907 1253.9526 1255.6487 1278.0726 1290.6632 1302.3783 1308.5531 1351.3415 1355.1237 1366.6079 1383.7951 1394.9156 1447.0913 1458.2583 1459.3735 1460.4271 1469.3947 1486.3866 1496.4639 1506.5103 1585.6205 1594.9064 1618.6137 1634.9569 3013.8246 3019.2798 3062.3666 3062.9963 3069.5838 3075.1454 3075.6248 3126.5511 3134.6350 3137.3919 3146.7619 3147.3140 3148.2168 3158.4185 3163.9256 3165.5440
redmass: 11.9090 8.9159 17.9514 9.7164 5.2576 5.6120 5.7519 3.0052 2.9920 4.8773 3.8071 9.1847 4.4432 5.6029 4.0737 5.3418 5.3875 4.4614 4.1397 4.7642 3.4021 3.1467 3.3459 4.8431 5.3096 4.9644 4.4702 4.3385 3.9909 6.9363 4.1065 6.4863 5.3660 4.5741 1.9473 4.2021 3.7231 1.8518 1.1653 1.1752 1.6041 4.2135 1.6672 1.5187 4.0072 1.3788 1.4226 2.5489 1.3352 4.1845 1.4353 2.0265 3.8941 3.2676 1.7641 2.1415 1.5427 1.9052 1.3924 1.1599 1.2487 1.2437 2.0586 1.9078 2.2517 1.7104 1.1663 1.1957 1.4093 1.1925 1.5256 1.7838 1.2719 1.3975 7.0346 1.8844 3.4053 2.5291 1.3212 1.4040 1.5490 2.6324 1.1971 2.8846 1.2477 7.2790 6.5791 7.2742 7.3696 1.0601 1.0608 1.0580 1.0578 1.1020 1.1034 1.0875 1.0856 1.0886 1.0894 1.1119 1.1119 1.0951 1.0910 1.0943 1.1001
irintensity: 0.2909 0.2676 0.8023 0.7329 1.6366 2.0467 2.4343 1.1769 0.4025 0.8507 0.4983 1.5521 0.8589 2.8078 12.9608 2.9208 3.2168 3.7080 0.6861 18.5832 4.3161 0.7809 1.0009 12.2462 4.9595 17.6376 3.8427 4.6168 11.4728 14.7710 15.9411 56.8232 96.6136 26.5454 70.1053 14.2430 27.7461 17.8481 1.1910 12.7512 25.4662 13.2965 13.1173 0.4915 12.7923 0.8698 1.9237 16.4157 0.1304 3.0958 3.4040 9.0310 0.5495 0.0726 2.8874 13.3176 44.0231 25.5343 6.9929 14.1241 11.1564 7.6510 14.3965 26.9865 30.6354 9.3239 17.9127 17.4151 49.9459 6.1949 15.5430 2.7996 13.5951 76.6427 4.7764 50.6396 1.9848 32.0230 21.7709 32.8832 26.1223 153.7814 39.1023 65.0198 99.4243 30.2419 3.4361 84.7776 175.5233 24.0429 20.8479 10.0402 17.9635 10.7567 9.1378 4.8308 4.7765 12.0636 1.1724 5.0016 18.7749 23.2293 12.4928 32.7000 26.9591
temp: 298.150 k
press: 1.00000 atm
elementType: 17 17 17 7 6 6 6 6 6 6 6 6 6 6 6 6 6 6 6 6 6 1 1 1 1 1 1 1 1 1 1 1 1 1 1 1 1
symmnumber: 1
zpe: 751487.7 jmol-1
zpe.correction: 0.286227 hartree
zpe.thermalcorrener: 0.305840 hartree
zpe.thermalcorrenthalpy: 0.306784 hartree
zpe.thermalcorrgfe: 0.234632 hartree
zpe.sumelectzpe: -2090.851192 hartree
zpe.sumelectthermal: -2090.831579 hartree
zpe.sumelectthermalent: -2090.830635 hartree
zpe.sumelectthermalfe: -2090.902787 hartree
dipole: -0.2709 -2.2655 0.9777
dipole: 2.4823
quadrupole: -142.9500 -157.0454 -144.3870
quadrupole: 8.1918 -3.3682 5.0399
quadrupole: 5.1775 -8.9179 3.7405 8.1918 -3.3682 5.0399
hfenergy: -2091.1374188 hartree
pointgroup: C01 [X(C17H16Cl3N1)]
dipole: -0.171251 -0.8755825 0.3972643 debye
polarizability: 370.9760497|1.6501678|246.0002583|-1.9617057|18.026888|115.7813338 unknown
InChI: InChI=1S/C17H16Cl3N/c18-7-9-21(10-8-19)12-5-6-14-13-3-1-2-4-15(13)17(20)16(14)11-12/h1-6,11,17H,7-10H2
charge 0 multiplicity 1
37 atoms
Cl -1.889729 2.987244 -0.558066
Cl 5.435442 -3.33576 0.129935
Cl 4.250825 3.909399 -0.010226
N  2.93148 -0.026505 0.0118
C  -0.766378 0.492896 0.251454
C  -1.923977 1.419528 0.571503
C  -1.274555 -0.778017 -0.146991
C  -3.152687 0.571584 0.314251
C  -2.749751 -0.734231 -0.106271
C  1.539343 -0.268917 -0.031609
C  0.604123 0.76137 0.309979
C  -0.363272 -1.798213 -0.481853
C  1.023578 -1.546892 -0.422061
C  -4.508777 0.903977 0.45175
C  -3.721126 -1.717501 -0.386134
C  3.903136 -1.048735 -0.412581
C  3.474648 1.260994 0.478959
C  -5.484417 -0.085985 0.167147
C  -5.090531 -1.382068 -0.24713
C  4.216727 -2.023909 0.738461
C  3.516866 2.294339 -0.66373
H  -1.883131 1.876209 1.572472
H  0.938118 1.764684 0.58792
H  -0.713108 -2.791126 -0.785174
H  1.705402 -2.361314 -0.682417
H  4.837507 -0.552264 -0.728774
H  3.531995 -1.606573 -1.290342
H  4.499645 1.103843 0.859125
H  2.883517 1.656289 1.32371
H  -4.810458 1.911617 0.757201
H  -3.430205 -2.724845 -0.70406
H  -6.548865 0.153104 0.264447
H  -5.856632 -2.135175 -0.463623
H  4.710113 -1.525133 1.585838
H  3.327493 -2.572777 1.079842
H  4.173736 1.976655 -1.48712
H  2.517706 2.549108 -1.044733
